Phenol, 2,6-bis(1,1-dimethylethyl)-
- Formula: C14H22O
- Molecular weight: 206.3239
- IUPAC Standard InChIKey: DKCPKDPYUFEZCP-UHFFFAOYSA-N
- CAS Registry Number: 128-39-2
- Chemical structure:

Gas phase thermochemistry data

Data compiled by: Hussein Y. Afeefy, Joel F. Liebman, and Stephen E. Stein
Quantity | Value | Units | Method | Reference | Comment |
---|---|---|---|---|---|
ΔfH°gas | -262. | kJ/mol | Ccb | Bertholon, Giray, et al., 1971 |

Condensed phase thermochemistry data

Data compiled by: Hussein Y. Afeefy, Joel F. Liebman, and Stephen E. Stein
Quantity | Value | Units | Method | Reference | Comment |
---|---|---|---|---|---|
ΔfH°solid | -370. | kJ/mol | Ccb | Bertholon, Giray, et al., 1971 | |
Quantity | Value | Units | Method | Reference | Comment |
ΔcH°solid | -8280. | kJ/mol | Ccb | Bertholon, Giray, et al., 1971 | Corresponding ΔfHºsolid = -370. kJ/mol (simple calculation by NIST; no Washburn corrections) |

Phase change data

Data compiled as indicated in comments:
BS - Robert L. Brown and Stephen E. Stein
TRC - Thermodynamics Research Center, NIST Boulder Laboratories, Chris Muzny director
AC - William E. Acree, Jr., James S. Chickos
ALS - Hussein Y. Afeefy, Joel F. Liebman, and Stephen E. Stein
DRB - Donald R. Burgess, Jr.
Quantity | Value | Units | Method | Reference | Comment |
---|---|---|---|---|---|
Tboil | 526.2 | K | N/A | Aldrich Chemical Company Inc., 1990 | BS |
Quantity | Value | Units | Method | Reference | Comment |
Tfus | 311. | K | N/A | Inozemtsev, Liakumovich, et al., 1972 | Uncertainty assigned by TRC = 0.2 K; TRC |
Tfus | 310.5 | K | N/A | Thomas and Meatyard, 1963 | Uncertainty assigned by TRC = 0.5 K; TRC |
Quantity | Value | Units | Method | Reference | Comment |
ΔvapH° | 66.0 ± 0.2 | kJ/mol | N/A | Verevkin, 1999 | AC |
Quantity | Value | Units | Method | Reference | Comment |
ΔsubH° | 81.5 ± 2.3 | kJ/mol | C | Ribeiro da Silva, Matos, et al., 1999 | AC |
ΔsubH° | 84.6 ± 0.5 | kJ/mol | GS | Verevkin, 1999 | AC |
ΔsubH° | 110.9 | kJ/mol | C | Bertholon, Giray, et al., 1971 | ALS |
ΔsubH° | 108.0 | kJ/mol | N/A | Bertholon, Giray, et al., 1971 | DRB |
Enthalpy of vaporization
ΔvapH (kJ/mol) | Temperature (K) | Method | Reference | Comment |
---|---|---|---|---|
63.5 ± 0.2 | 341. | GS | Verevkin, 1999 | Based on data from 313. to 368. K.; AC |
60.4 | 401. | A | Stephenson and Malanowski, 1987 | Based on data from 386. to 530. K.; AC |
Enthalpy of fusion
ΔfusH (kJ/mol) | Temperature (K) | Reference | Comment |
---|---|---|---|
16.57 | 310.7 | Inozemtsev, Liakumovich, et al., 1972 | AC |

Reaction thermochemistry data

Data compiled by: Hussein Y. Afeefy, Joel F. Liebman, and Stephen E. Stein
Individual Reactions
By formula: C18H30O + C10H14O = C14H22O + C14H22O
Quantity | Value | Units | Method | Reference | Comment |
---|---|---|---|---|---|
ΔrH° | 0.1 ± 0.46 | kJ/mol | Eqk | Pil'shchikov, Nesterova, et al., 1981 | liquid phase |
By formula: C6H6O + C14H22O = 2C10H14O
Quantity | Value | Units | Method | Reference | Comment |
---|---|---|---|---|---|
ΔrH° | -12.8 ± 0.54 | kJ/mol | Eqk | Pil'shchikov, Nesterova, et al., 1981 | liquid phase |

Gas phase ion energetics data

Data compiled as indicated in comments:
LBLHLM - Sharon G. Lias, John E. Bartmess, Joel F. Liebman, John L. Holmes, Rhoda D. Levin, and W. Gary Mallard
LLK - Sharon G. Lias, Rhoda D. Levin, and Sherif A. Kafafi
Ionization energy determinations
IE (eV) | Method | Reference | Comment |
---|---|---|---|
7.70 ± 0.02 | PE | Maier and Turner, 1973 | LLK |
8.15 | PE | Cetinkaya, Lappert, et al., 1983 | Vertical value; LBLHLM |

Van Den Dool and Kratz RI, non-polar column, temperature ramp

Column type | Active phase | I | Reference | Comment |
---|---|---|---|---|
Capillary | DB-5 | 1433.6 | Song, Lai, et al., 2003 | 30. m/0.25 mm/0.25 μm, He, 2. K/min; Tstart: 40. C; Tend: 310. C |
Capillary | DB-5 | 1440.1 | Song, Lai, et al., 2003 | 30. m/0.25 mm/0.25 μm, He, 4. K/min; Tstart: 40. C; Tend: 310. C |
Capillary | DB-5 | 1443.2 | Song, Lai, et al., 2003 | 30. m/0.25 mm/0.25 μm, He, 6. K/min; Tstart: 40. C; Tend: 310. C |
Capillary | DB-5 | 1433.6 | Lai and Song, 1995 | 30. m/0.25 mm/0.25 μm, He, 2. K/min; Tstart: 40. C; Tend: 310. C |
Capillary | DB-5 | 1440.1 | Lai and Song, 1995 | 30. m/0.25 mm/0.25 μm, He, 4. K/min; Tstart: 40. C; Tend: 310. C |
Capillary | DB-5 | 1443.2 | Lai and Song, 1995 | 30. m/0.25 mm/0.25 μm, He, 6. K/min; Tstart: 40. C; Tend: 310. C |

Normal alkane RI, non-polar column, custom temperature program

Column type | Active phase | I | Reference | Comment |
---|---|---|---|---|
Capillary | HP-5MS | 1444. | Ansorena, Gimeno, et al., 2001 | 30. m/0.25 mm/0.25 μm, He; Program: 40C (10min) => 3C/min => 120C => 10C/min => 250C (5min) |

Normal alkane RI, polar column, temperature ramp

Column type | Active phase | I | Reference | Comment |
---|---|---|---|---|
Capillary | Stabilwax | 2327. | Cros, Vandanjon, et al., 2007 | 60. m/0.25 mm/0.25 μm, Helium, 40. C @ 5. min, 3. K/min, 240. C @ 10. min |

References

Bertholon, Giray, et al., 1971
Bertholon, G.; Giray, M.; Perrin, R.; Vincent-Falquet-Berny, M.F.,
No. 532. - Etude physicochimique des phenols. OX. - Ethanlpies de combustion et energies de resonance des alcoyl et aryphenols,
Bull. Soc. Chim. France, 1971, 3180-3187. [all data]
Aldrich Chemical Company Inc., 1990
Aldrich Chemical Company Inc.,
Catalog Handbook of Fine Chemicals, Aldrich Chemical Company, Inc., Milwaukee WI, 1990, 1. [all data]
Inozemtsev, Liakumovich, et al., 1972
Inozemtsev, P.P.; Liakumovich, A.G.; Gracheva, Z.D.,
Russ. J. Phys. Chem., 1972, 46, 6, 914. [all data]
Thomas and Meatyard, 1963
Thomas, L.H.; Meatyard, R.,
Viscosity and Molecular Association. IV. Association of Monohydric Alcohols and Some Hindered Phenols.,
J. Chem. Soc., 1963, 1963, 1986-2002. [all data]
Verevkin, 1999
Verevkin, Sergey P.,
Thermochemistry of phenols: buttress effects in sterically hindered phenols,
The Journal of Chemical Thermodynamics, 1999, 31, 11, 1397-1416, https://doi.org/10.1006/jcht.1999.0466
. [all data]
Ribeiro da Silva, Matos, et al., 1999
Ribeiro da Silva, M.A.V.; Matos, M.A.R.; Morais, V.M.F.; Miranda, M.S.,
Thermochemical and Theoretical Study of tert -Butyl and Di- tert -butylphenol Isomers,
J. Org. Chem., 1999, 64, 24, 8816-8820, https://doi.org/10.1021/jo990801o
. [all data]
Stephenson and Malanowski, 1987
Stephenson, Richard M.; Malanowski, Stanislaw,
Handbook of the Thermodynamics of Organic Compounds, 1987, https://doi.org/10.1007/978-94-009-3173-2
. [all data]
Pil'shchikov, Nesterova, et al., 1981
Pil'shchikov, V.A.; Nesterova, T.N.; Rozhnov, A.M.,
Equilibrium in the system phenol-tert-butylphenols,
J. Appl. Chem. USSR, 1981, 54, 1765-1769. [all data]
Maier and Turner, 1973
Maier, J.P.; Turner, D.W.,
Steric inhibition of resonance studied by molecular photoelectron spectroscopy Part 3. Anilines, Phenols and Related Compounds,
J. Chem. Soc. Faraday Trans. 2, 1973, 69, 521. [all data]
Cetinkaya, Lappert, et al., 1983
Cetinkaya, B.; Lappert, M.F.; Suffolk, R.J.,
Photoelectron spectra of some sterically hindered phenols and related compounds,
J. Chem. Res. Synop., 1983, 316. [all data]
(editor), 1983
(editor), Koptyug V.A.,
Atlas of Spectra of Aromatic and Heterocyclic Compounds, 1983, 25, 13. [all data]