N-Chlorosuccinimide
- Formula: C4H4ClNO2
- Molecular weight: 133.533
- IUPAC Standard InChIKey: JRNVZBWKYDBUCA-UHFFFAOYSA-N
- CAS Registry Number: 128-09-6
- Chemical structure:
View 3d structure (requires JavaScript / HTML 5) - Other names: 2,5-Pyrrolidinedione, 1-chloro-; Succinimide, N-chloro-; Chlorosuccinimide; Succinchlorimide; Succinic N-chloroimide; 1-Chloro-2,5-pyrrolidinedione; Succinochlorimide; NCS; NSC 8748

Condensed phase thermochemistry data

Data compiled by: Hussein Y. Afeefy, Joel F. Liebman, and Stephen E. Stein
Quantity | Value | Units | Method | Reference | Comment |
---|---|---|---|---|---|
ΔfH°solid | -358.1 ± 0.4 | kJ/mol | Cm | Howard and Skinner, 1966 |

Reaction thermochemistry data

Data compiled by: Hussein Y. Afeefy, Joel F. Liebman, and Stephen E. Stein
Individual Reactions
By formula: C4H4ClNO2 + 0.5H4N2 = C4H5NO2 + HCl + 0.5N2
Quantity | Value | Units | Method | Reference | Comment |
---|---|---|---|---|---|
ΔrH° | -283.6 ± 0.3 | kJ/mol | Cm | Howard and Skinner, 1966 | solid phase; solvent: Aqueous solution |

Gas phase ion energetics data

Data compiled by: Sharon G. Lias, Rhoda D. Levin, and Sherif A. Kafafi
Ionization energy determinations
IE (eV) | Method | Reference | Comment |
---|---|---|---|
10.29 | PE | Worley, Gerson, et al., 1978 | Vertical value |
10.29 | PE | Gerson, Worley, et al., 1978 | Vertical value |

References

Howard and Skinner, 1966
Howard, P.B.; Skinner, H.A.,
Thermochemistry of some reactions of aqueous hydrazine with halogens, hydrogen halides and N-halogenosuccinimides,
J. Chem. Soc. A, 1966, 1536-1540. [all data]
Worley, Gerson, et al., 1978
Worley, S.D.; Gerson, S.H.; Bodor, N.; Kaminski, J.J.; Flechtner, T.W.,
On the structure of N-chlorosuccinimide and N-bromosuccinimide. A photoelectron spectroscopic study,
J. Chem. Phys., 1978, 68, 1313. [all data]
Gerson, Worley, et al., 1978
Gerson, S.H.; Worley, S.D.; Bodor, N.; Kaminski, J.J.; Flechtner, T.W.,
The photoelectron spectra of some heterocyclic compounds which contain N, O, Cl, and Br,
J. Electron Spectrosc. Relat. Phenom., 1978, 13, 421. [all data]