Niobocene dichloride
- Formula: C10H10Cl2Nb
- Molecular weight: 293.999
- CAS Registry Number: 12793-14-5

Phase change data

Data compiled by: William E. Acree, Jr., James S. Chickos
Quantity | Value | Units | Method | Reference | Comment |
---|---|---|---|---|---|
ΔsubH° | 127.4 ± 4.4 | kJ/mol | ME | Diogo, Minas da Piedade, et al., 2001 |

Gas phase ion energetics data

Data compiled by: Sharon G. Lias, Rhoda D. Levin, and Sherif A. Kafafi
Ionization energy determinations
IE (eV) | Method | Reference | Comment |
---|---|---|---|
6.8 | PE | Van Dam, Terpstra, et al., 1981 | Vertical value |

References

Diogo, Minas da Piedade, et al., 2001
Diogo, Hermínio P.; Minas da Piedade, Manuel E.; Gonçalves, Jorge M.; Monte, Manuel J.S.; Ribeiro da Silva, Manuel A.V.,
Enthalpies of Sublimation of M(η5-C5H5)2Cl2 (M = Ti, Zr, Hf, V, Nb, W) Complexes,
Eur. J. Inorg. Chem., 2001, 2001, 1, 257-262, https://doi.org/10.1002/1099-0682(20011)2001:1<257::AID-EJIC257>3.0.CO;2-2
. [all data]
Van Dam, Terpstra, et al., 1981
Van Dam, H.; Terpstra, A.; Oskam, A.; Teuben, J.H.,
UV photoelectron spectra of some bent bis(η5-cyclopentadienyl)Niobium and tantalum complexes,
Z. Naturforsch. B:, 1981, 36, 420. [all data]