Cobaltocene
- Formula: C10H10Co
- Molecular weight: 189.1196
- IUPAC Standard InChIKey: PXFGMRZPRDJDEK-UHFFFAOYSA-N
- CAS Registry Number: 1277-43-6
- Chemical structure:

Gas phase thermochemistry data

Data compiled by: José A. Martinho Simões
Quantity | Value | Units | Method | Reference | Comment |
---|---|---|---|---|---|
ΔfH°gas | 309.0 ± 2.5 | kJ/mol | Review | Martinho Simões | |
ΔfH°gas | 277. ± 4. | kJ/mol | Review | Martinho Simões |

Condensed phase thermochemistry data

Data compiled as indicated in comments:
MS - José A. Martinho Simões
DH - Eugene S. Domalski and Elizabeth D. Hearing
Quantity | Value | Units | Method | Reference | Comment |
---|---|---|---|---|---|
ΔfH°solid | 236.9 ± 2.5 | kJ/mol | Review | Martinho Simões | MS |
ΔfH°solid | 205. ± 4. | kJ/mol | CC-SB | Chipperfield, Sneyd, et al., 1979 | Value corrected based on a set of ancillary data by J.A. Martinho Simões; The enthalpy of combustion is not reported in Chipperfield, Sneyd, et al., 1979.; MS |
Quantity | Value | Units | Method | Reference | Comment |
ΔcH°solid | -5838.8 ± 2.1 | kJ/mol | CC-SB | Tel'noi, Kirynov, et al., 1975 | Please also see Pedley and Rylance, 1977 and Tel'noi and Rabinovich, 1977.; MS |
Quantity | Value | Units | Method | Reference | Comment |
S°solid,1 bar | 236.0 | J/mol*K | N/A | Rabinovich, Nistratov, et al., 1978 | DH |
S°solid,1 bar | 236.1 | J/mol*K | N/A | Rabinovich, Nistratov, et al., 1975 | DH |
Constant pressure heat capacity of solid
Cp,solid (J/mol*K) | Temperature (K) | Reference | Comment |
---|---|---|---|
197.5 | 298.15 | Rabinovich, Nistratov, et al., 1978 | T = 5 to 300 K.; DH |
197.3 | 298.15 | Rabinovich, Nistratov, et al., 1975 | T = 5 to 298.15 K.; DH |

Gas phase ion energetics data

Data compiled as indicated in comments:
LLK - Sharon G. Lias, Rhoda D. Levin, and Sherif A. Kafafi
RDSH - Henry M. Rosenstock, Keith Draxl, Bruce W. Steiner, and John T. Herron
Ionization energy determinations
IE (eV) | Method | Reference | Comment |
---|---|---|---|
5.7 ± 0.2 | EI | Begun and Compton, 1973 | LLK |
6.0 ± 0.1 | EI | Puttemans and Hanson, 1971 | LLK |
6.0 ± 0.1 | EI | Pignataro and Lossing, 1967 | RDSH |
6.2 ± 0.1 | EI | Muller and D'Or, 1967 | RDSH |
5.55 | PE | Cauletti, Green, et al., 1980 | Vertical value; LLK |
5.56 | PE | Evans, Green, et al., 1974 | Vertical value; LLK |
Appearance energy determinations
Ion | AE (eV) | Other Products | Method | Reference | Comment |
---|---|---|---|---|---|
C3H3Co+ | 17.5 ± 0.2 | ? | EI | Puttemans and Hanson, 1971 | LLK |
C3H3Co+ | 17.6 ± 0.1 | ? | EI | Muller and D'Or, 1967 | RDSH |
C5H5Co+ | 13.2 ± 0.2 | ? | EI | Puttemans and Hanson, 1971 | LLK |
C5H5Co+ | 12. ± 1. | ? | EI | Pignataro and Lossing, 1967 | RDSH |
C5H5Co+ | 14.0 ± 0.1 | ? | EI | Muller and D'Or, 1967 | RDSH |
Co+ | 14.10 ± 0.15 | ? | EI | Puttemans and Hanson, 1971 | LLK |
Co+ | 14.7 ± 0.2 | ? | EI | Muller and D'Or, 1967 | RDSH |

Phase change data

Data compiled as indicated in comments:
MS - José A. Martinho Simões
AC - William E. Acree, Jr., James S. Chickos
DH - Eugene S. Domalski and Elizabeth D. Hearing
Quantity | Value | Units | Method | Reference | Comment |
---|---|---|---|---|---|
ΔsubH° | 17.2 ± 0.02 | kcal/mol | CC-SB | Torres-Gómez, Barreiro-Rodríguez, et al., 1988 | Another value for the enthalpy of sublimation has been reported: 16.8 ± 1.0 kcal/mol Tel'noi, Kirynov, et al., 1975; MS |
ΔsubH° | 16.8 ± 1.0 | kcal/mol | N/A | Pilcher and Skinner, 1983 | See also Tel'noi, Kirynov, et al., 1975.; AC |
Enthalpy of phase transition
ΔHtrs (kcal/mol) | Temperature (K) | Initial Phase | Final Phase | Reference | Comment |
---|---|---|---|---|---|
0.0569 | 93.5 | crystaline, II | crystaline, I | Rabinovich, Nistratov, et al., 1978 | Lambda transition between 70 to 120 K with a maximum at 93.5 K.; DH |
0.0569 | 92. | crystaline, II | crystaline, I | Rabinovich, Nistratov, et al., 1975 | Lambda transition between 70 to 140 K with a maximum at 92 K.; DH |
Entropy of phase transition
ΔStrs (cal/mol*K) | Temperature (K) | Initial Phase | Final Phase | Reference | Comment |
---|---|---|---|---|---|
0.650 | 93.5 | crystaline, II | crystaline, I | Rabinovich, Nistratov, et al., 1978 | Lambda; DH |
0.652 | 92. | crystaline, II | crystaline, I | Rabinovich, Nistratov, et al., 1975 | Lambda; DH |

References

Martinho Simões
Martinho Simões, J.A.,
Private communication (see http://webbook.nist.gov/chemistry/om/). [all data]
Chipperfield, Sneyd, et al., 1979
Chipperfield, J.R.; Sneyd, J.C.R.; Webster, D.E.,
J. Organometal. Chem., 1979, 178, 177. [all data]
Tel'noi, Kirynov, et al., 1975
Tel'noi, V.I.; Kirynov, K.V.; Ermolaev, V.I.; Rabinovich, I.B.,
Dokl. Akad. Nauk SSSR, 1975, 220, 1088. [all data]
Pedley and Rylance, 1977
Pedley, J.B.; Rylance, J.,
Computer Analysed Thermochemical Data: Organic and Organometallic Compounds, University of Sussex, Brigton, 1977. [all data]
Tel'noi and Rabinovich, 1977
Tel'noi, V.I.; Rabinovich, I.B.,
Russ. Chem. Rev., 1977, 46, 689. [all data]
Rabinovich, Nistratov, et al., 1978
Rabinovich, I.B.; Nistratov, V.P.; Sheiman, M.S.; Burchalova, G.V.,
Heat capacities of dicyclopentadienyl compounds of vanadium, chromium, manganese, cobalt, and nickel,
J. Chem. Thermodynam., 1978, 10, 523-536. [all data]
Rabinovich, Nistratov, et al., 1975
Rabinovich, I.B.; Nistratov, V.P.; Sheiman, M.S.; Burchalova, G.V.,
Heat capacity and transitions in solid state. Dicyclopentadienyl compounds of transition elements,Quatrieme Conference International de Thermodynamique Chimique II,
Thermophysiques (capacites thermiques) pp., 1975, 69-76, 136. [all data]
Begun and Compton, 1973
Begun, G.M.; Compton, R.N.,
Electron impact ionization studies of ferrocene, cobaltocene, nickelocene, and magnesocene,
J. Chem. Phys., 1973, 58, 2271. [all data]
Puttemans and Hanson, 1971
Puttemans, J.-P.; Hanson, A.,
Etude energetique du ferrocene et du cobaltocene par impact electronique. Enthalpie de formation du radical cyclopentadienyle,
Ing. Chim. (Brussels), 1971, 53, 17. [all data]
Pignataro and Lossing, 1967
Pignataro, S.; Lossing, F.P.,
Mass spectra and ionization potentials of C6H6CrC6H6 and C6H6Cr(CO)3,
J. Organometal. Chem., 1967, 10, 531. [all data]
Muller and D'Or, 1967
Muller, J.; D'Or, L.,
Massenspektrometrische Untersuchungen an Dicyclopentadienylkomplexen von Ubergangsmetallen,
J.Organometal. Chem., 1967, 10, 313. [all data]
Cauletti, Green, et al., 1980
Cauletti, C.; Green, J.C.; Kelly, M.R.; Powell, P.; Van Tilborg, J.,
Photoelectron spectra of metallocenes,
J. Electron Spectrosc. Relat. Phenom., 1980, 19, 327. [all data]
Evans, Green, et al., 1974
Evans, S.; Green, M.L.H.; Jewitt, B.; King, G.H.; Orchard, A.F.,
Electronic structures of metal complexes containing the π-cyclopentadienyl and related ligands Part 2. He I photoelectron spectra of the open-shell metallocenes,
J. Chem. Soc. Faraday Trans. 2, 1974, 70, 356. [all data]