Diphenyl sulfone
- Formula: C12H10O2S
- Molecular weight: 218.272
- IUPAC Standard InChIKey: KZTYYGOKRVBIMI-UHFFFAOYSA-N
- CAS Registry Number: 127-63-9
- Chemical structure:
View 3d structure (requires JavaScript / HTML 5) - Other names: Benzene, 1,1'-sulfonylbis-; Phenyl sulfone; DPS; Sulfobenzide; Sulfone, diphenyl; Difenylsulfon; Diphenyl sulphone; Phenyl sulphone; (Phenylsulfonyl)benzene; NSC 627706; NSC 6780

Gas phase thermochemistry data

Data compiled by: Hussein Y. Afeefy, Joel F. Liebman, and Stephen E. Stein
Quantity | Value | Units | Method | Reference | Comment |
---|---|---|---|---|---|
ΔfH°gas | -118.7 ± 3.3 | kJ/mol | Ccr | Mackle and O'Hare, 1961 | Reanalyzed by Cox and Pilcher, 1970, Original value = -117. ± 3. kJ/mol; Haet of combustion corrected for pressure |

Condensed phase thermochemistry data

Data compiled as indicated in comments:
ALS - Hussein Y. Afeefy, Joel F. Liebman, and Stephen E. Stein
DH - Eugene S. Domalski and Elizabeth D. Hearing
Quantity | Value | Units | Method | Reference | Comment |
---|---|---|---|---|---|
ΔfH°solid | -225.0 ± 1.6 | kJ/mol | Ccr | Mackle and O'Hare, 1961 | Reanalyzed by Cox and Pilcher, 1970, Original value = -223. ± 0.8 kJ/mol; Haet of combustion corrected for pressure; ALS |
Quantity | Value | Units | Method | Reference | Comment |
ΔcH°solid | -6528.5 ± 1.5 | kJ/mol | Ccr | Mackle and O'Hare, 1961 | Reanalyzed by Cox and Pilcher, 1970, Original value = -6530.4 ± 0.3 kJ/mol; Haet of combustion corrected for pressure; ALS |
Constant pressure heat capacity of solid
Cp,solid (J/mol*K) | Temperature (K) | Reference | Comment |
---|---|---|---|
244.3 | 298.5 | Smith and Andrews, 1931 | T = 102 to 346 K.; DH |

Phase change data

Data compiled as indicated in comments:
TRC - Thermodynamics Research Center, NIST Boulder Laboratories, Chris Muzny director
ALS - Hussein Y. Afeefy, Joel F. Liebman, and Stephen E. Stein
Quantity | Value | Units | Method | Reference | Comment |
---|---|---|---|---|---|
Tfus | 398. ± 4. | K | AVG | N/A | Average of 14 out of 15 values; Individual data points |
Quantity | Value | Units | Method | Reference | Comment |
ΔsubH° | 106. ± 2. | kJ/mol | V | Mackle and O'Hare, 1961 | Haet of combustion corrected for pressure; ALS |

Reaction thermochemistry data

Data compiled by: Robert C. Dunbar
Individual Reactions
By formula: Li+ + C12H10O2S = (Li+ • C12H10O2S)
Quantity | Value | Units | Method | Reference | Comment |
---|---|---|---|---|---|
ΔrH° | 218. | kJ/mol | CIDC | Buncel, Decouzon, et al., 1997 |

Gas phase ion energetics data

Data evaluated as indicated in comments:
L - Sharon G. Lias
Data compiled as indicated in comments:
LLK - Sharon G. Lias, Rhoda D. Levin, and Sherif A. Kafafi
Quantity | Value | Units | Method | Reference | Comment |
---|---|---|---|---|---|
IE (evaluated) | 9.16 | eV | N/A | N/A | L |
Ionization energy determinations
IE (eV) | Method | Reference | Comment |
---|---|---|---|
9.2 | PE | Traven', Redchenko, et al., 1981 | LLK |
9.16 ± 0.03 | PI | Evlasheva, Puchkova, et al., 1975 | LLK |
9.7 | EI | Terlouw, Heerma, et al., 1974 | LLK |
9.46 | PE | Traven', Redchenko, et al., 1981 | Vertical value; LLK |
9.37 | PE | Solouki, Bock, et al., 1975 | Vertical value; LLK |

Ion clustering data

Data compiled by: Robert C. Dunbar
Clustering reactions
By formula: Li+ + C12H10O2S = (Li+ • C12H10O2S)
Quantity | Value | Units | Method | Reference | Comment |
---|---|---|---|---|---|
ΔrH° | 218. | kJ/mol | CIDC | Buncel, Decouzon, et al., 1997 |

References

Mackle and O'Hare, 1961
Mackle, H.; O'Hare, P.A.G.,
Studies in the thermochemistry of sulphones. Part 6 - Heats of combustion, fusion, vaporization and atomization of six aromatic and two allylic sulphones,
Trans. Faraday Soc., 1961, 57, 1521-1526. [all data]
Cox and Pilcher, 1970
Cox, J.D.; Pilcher, G.,
Thermochemistry of Organic and Organometallic Compounds, Academic Press, New York, 1970, 1-636. [all data]
Smith and Andrews, 1931
Smith, R.H.; Andrews, D.H.,
Thermal energy studies. II. Phenyl derivatives of metals,
J. Am. Chem. Soc., 1931, 53, 3661-3667. [all data]
Buncel, Decouzon, et al., 1997
Buncel, E.; Decouzon, M.; Formento, A.; Gal, J.-F.; Herreros, M.; Li, L.; Maria, P.-C.,
Lithium-Cation and Proton Affinities of Sulfoxides and Sulfones: A Fourier Transform Ion Cyclotron Resonance Study,
J. Am. Soc. Mass Spectrom., 1997, 8, 3, 262, https://doi.org/10.1016/S1044-0305(96)00255-3
. [all data]
Traven', Redchenko, et al., 1981
Traven', V.F.; Redchenko, V.V.; Eismont, M.Y.; Stepanov, B.I.,
Photoelectron spectra and electronic and steric structures of silicon and sulfur-containing analogs of 9,10-dihydroanthracene,
J. Gen. Chem. USSR, 1981, 51, 1099, In original 1297. [all data]
Evlasheva, Puchkova, et al., 1975
Evlasheva, T.I.; Puchkova, V.V.; Potapov, V.K.; Gur'yanova, E.N.,
Ionisation potentials and electron-donating properties of sulphones,
Russ. J. Phys. Chem., 1975, 49, 453. [all data]
Terlouw, Heerma, et al., 1974
Terlouw, J.K.; Heerma, W.; Frintrop, P.C.M.; Dijkstra, G.; Meinema, H.A.,
Electron-impact induced fragmentation of some heterocyclic-tin compounds,
J. Organomet. Chem., 1974, 64, 205. [all data]
Solouki, Bock, et al., 1975
Solouki, B.; Bock, H.; Appel, R.,
Photoelektronenspektren und Molekuleigenschaften, XLV Schwefelsaure-Derivate X2SY2: Alkyl-, Vinyl- und Arylsulfone, Alkylsulfoimide und Sulfurylhalogenide,
Chem. Ber., 1975, 108, 897. [all data]