Osmocene
- Formula: C10H10Os
- Molecular weight: 320.42
- IUPAC Standard InChIKey: RBPKLTFNJHKDRH-UHFFFAOYSA-N
- CAS Registry Number: 1273-81-0
- Chemical structure:

Condensed phase thermochemistry data

Data compiled by: José A. Martinho Simões
Quantity | Value | Units | Method | Reference | Comment |
---|---|---|---|---|---|
ΔfH°solid | 283.8 | kJ/mol | Review | Martinho Simões | The enthalpy of formation relies on the assumption that OsO4(cr, yellow) is the only oxide formed but it is likely that the combustion products include a mixture of oxides. |
Quantity | Value | Units | Method | Reference | Comment |
ΔcH°solid | -6041.7 | kJ/mol | CC-SB | Brendel and Grubert, 1959 | No experimental details are reported. |

Phase change data

Data compiled as indicated in comments:
TRC - Thermodynamics Research Center, NIST Boulder Laboratories, Chris Muzny director
AC - William E. Acree, Jr., James S. Chickos
MS - José A. Martinho Simões
Quantity | Value | Units | Method | Reference | Comment |
---|---|---|---|---|---|
Tboil | 571. | K | N/A | Baev, Barkatin, et al., 1979 | Uncertainty assigned by TRC = 0.00001 K; TRC |
Quantity | Value | Units | Method | Reference | Comment |
Tfus | 506.8 | K | N/A | Baev, Barkatin, et al., 1979 | Crystal phase 1 phase; Uncertainty assigned by TRC = 0.5 K; TRC |
Quantity | Value | Units | Method | Reference | Comment |
ΔsubH° | 80.5 ± 1.7 | kJ/mol | N/A | Baev and Barkatin, 1984 | AC |
ΔsubH° | 80.5 ± 1.7 | kJ/mol | CC-SB | Baev and Barkatin, 1984 | Another value for the enthalpy of vaporization has been reported: 75.3 kJ/mol Fischer and Grubert, 1959; MS |
Enthalpy of vaporization
ΔvapH (kJ/mol) | Temperature (K) | Reference | Comment |
---|---|---|---|
56.3 ± 1.3 | 535. | Baev and Barkatin, 1984 | Based on data from 506. to 563. K.; AC |
Enthalpy of sublimation
ΔsubH (kJ/mol) | Temperature (K) | Reference | Comment |
---|---|---|---|
72.9 ± 1.4 | 393. to 506. | Baev and Barkatin, 1984 | AC |

Gas phase ion energetics data

Data compiled as indicated in comments:
LL - Sharon G. Lias and Joel F. Liebman
RDSH - Henry M. Rosenstock, Keith Draxl, Bruce W. Steiner, and John T. Herron
Ionization energy determinations
IE (eV) | Method | Reference | Comment |
---|---|---|---|
~7.0 | EQ | Ryan, Eyler, et al., 1992 | LL |
7.6 ± 0.1 | EI | Muller and D'Or, 1967 | RDSH |

Gas phase thermochemistry data

Data compiled by: José A. Martinho Simões
Quantity | Value | Units | Method | Reference | Comment |
---|---|---|---|---|---|
ΔfH°gas | 364.3 | kJ/mol | Review | Martinho Simões | The enthalpy of formation relies on the assumption that OsO4(cr, yellow) is the only oxide formed but it is likely that the combustion products include a mixture of oxides. |

References

Martinho Simões
Martinho Simões, J.A.,
Private communication (see http://webbook.nist.gov/chemistry/om/). [all data]
Brendel and Grubert, 1959
Brendel, G.; Grubert, H.,
Chem. Ber., 1959, 92, 2302. [all data]
Baev, Barkatin, et al., 1979
Baev, A.K.; Barkatin, A.A.; Gubin, S.P.; Dyagileva, S.P.,
Thermodynamics of phase transitions and vapor state of some compounds of elements with incomplete d-shells
in Vses. Konf. po Kalorimetrii i Khim. Termodinamike, 8th, Ivanovo, p 386-389, 1979. [all data]
Baev and Barkatin, 1984
Baev, A.K.; Barkatin, A.A.,
Russ. J. Phys. Chem., 1984, 58, 195. [all data]
Fischer and Grubert, 1959
Fischer, E.O.; Grubert, H.,
Chem. Ber., 1959, 92, 2302. [all data]
Ryan, Eyler, et al., 1992
Ryan, M.F.; Eyler, J.R.; Richardson, D.E.,
Adiabatic ionization energies, bond disruption enthalpies, and solvation free energies for gas-phase metallocenes and metallocenium ions,
J. Am. Chem. Soc., 1992, 114, 8611. [all data]
Muller and D'Or, 1967
Muller, J.; D'Or, L.,
Massenspektrometrische Untersuchungen an Dicyclopentadienylkomplexen von Ubergangsmetallen,
J.Organometal. Chem., 1967, 10, 313. [all data]