Iron, bis[(1,2,3,3a,7a-η)-1H-inden-1-yl]-

Gas phase ion energetics data

Data compiled by: Sharon G. Lias and Joel F. Liebman

Ionization energy determinations

IE (eV) Method Reference Comment
6.1PECrossley, Green, et al., 1989
6.50PECrossley, Green, et al., 1989Vertical value

References

Crossley, Green, et al., 1989
Crossley, N.S.; Green, J.C.; Nagy, A.; Stringer, G., Electronic structure of transition-metal indenyl compounds: A He I and He II photoelectron spectroscopic study of [Mn(η5-C9H7)(CO)3], [Fe(η5-C9H7)2], [Ru(η5-C9H7)2], and [Ru(η5-C9H7)(n-C5Me5)], J. Chem. Soc. Dalton Trans., 1989, 2139. [all data]