tris(η5-2,4-cyclopentadien-1-yl)thulium
- Formula: C15H15Tm
- Molecular weight: 364.2138
- CAS Registry Number: 1272-26-0

Condensed phase thermochemistry data

Data compiled by: José A. Martinho Simões
Quantity | Value | Units | Method | Reference | Comment |
---|---|---|---|---|---|
ΔfH°solid | -49.5 ± 5.1 | kJ/mol | Review | Martinho Simões | |
Quantity | Value | Units | Method | Reference | Comment |
ΔcH°solid | -8941.2 ± 4.2 | kJ/mol | CC-SB | Devyatykh, Rabinovich, et al., 1974 | Please also see Pedley and Rylance, 1977 and Tel'noi and Rabinovich, 1977. |

Phase change data

Data compiled as indicated in comments:
AC - William E. Acree, Jr., James S. Chickos
MS - José A. Martinho Simões
Quantity | Value | Units | Method | Reference | Comment |
---|---|---|---|---|---|
ΔsubH° | 111.3 ± 3.5 | kJ/mol | N/A | Pilcher and Skinner, 1983 | See also Devyatykh, Rabinovitch, et al., 1974.; AC |
ΔsubH° | 111.3 ± 3.5 | kJ/mol | CC-SB | Devyatykh, Borisov, et al., 1973 | MS |
Enthalpy of sublimation
ΔsubH (kJ/mol) | Temperature (K) | Method | Reference | Comment |
---|---|---|---|---|
109.2 ± 2.1 | 338. to 438. | ME | Haug, 1971 | See also Haug, 1971, 2.; AC |

Gas phase ion energetics data

Data compiled as indicated in comments:
RDSH - Henry M. Rosenstock, Keith Draxl, Bruce W. Steiner, and John T. Herron
Ionization energy determinations
IE (eV) | Method | Reference | Comment |
---|---|---|---|
7.4 ± 0.1 | EI | Muller, 1969 | RDSH |

Gas phase thermochemistry data

Data compiled by: José A. Martinho Simões
Quantity | Value | Units | Method | Reference | Comment |
---|---|---|---|---|---|
ΔfH°gas | 61.8 ± 6.2 | kJ/mol | Review | Martinho Simões |

References

Martinho Simões
Martinho Simões, J.A.,
Private communication (see http://webbook.nist.gov/chemistry/om/). [all data]
Devyatykh, Rabinovich, et al., 1974
Devyatykh, C.G.; Rabinovich, I.B.; Tel'noi, V.I.; Borisov, G.K.; Zyazina, L.F.,
Dokl. Akad. Nauk SSSR, 1974, 217, 609. [all data]
Pedley and Rylance, 1977
Pedley, J.B.; Rylance, J.,
Computer Analysed Thermochemical Data: Organic and Organometallic Compounds, University of Sussex, Brigton, 1977. [all data]
Tel'noi and Rabinovich, 1977
Tel'noi, V.I.; Rabinovich, I.B.,
Russ. Chem. Rev., 1977, 46, 689. [all data]
Pilcher and Skinner, 1983
Pilcher, G.; Skinner, H.A.,
Thermochemistry of organometallic compounds, 1983, 43-90, https://doi.org/10.1002/9780470771686.ch2
. [all data]
Devyatykh, Rabinovitch, et al., 1974
Devyatykh, C.G.; Rabinovitch, I.B.; Tel'noi, V.I.; Borisov, G.K.; Zyazina, L.F.,
Dokl. Akad. Nauk SSSR, 1974, 217, 673. [all data]
Devyatykh, Borisov, et al., 1973
Devyatykh, G.G.; Borisov, G.K.; Zyuzina, L.F.; Krasnova, S.G.,
Dokl. Akad. Nauk SSSR, 1973, 212, 1, 127. [all data]
Haug, 1971
Haug, H.O.,
Ges. Kernforsch m.b.H. [Rep.] KFK-1283, 1971, 23. [all data]
Haug, 1971, 2
Haug, H.O.,
Dampfdruckmessungen von cyclopentadienylkomplexen des urans und einiger lanthaniden nach der effusionsmethode,
Journal of Organometallic Chemistry, 1971, 30, 1, 53-57, https://doi.org/10.1016/S0022-328X(00)82595-4
. [all data]
Muller, 1969
Muller, J.,
Massenspektroskopische Untersuchungen an Tri- und Tetracyclopentadienyl-metall-Komplexen,
Chem. Ber., 1969, 102, 152. [all data]