tris(η5-cyclopenta-2,4-dien-1-yl)lanthanum
- Formula: C15H15La
- Molecular weight: 334.1851
- CAS Registry Number: 1272-23-7

Gas phase thermochemistry data

Data compiled by: José A. Martinho Simões
Quantity | Value | Units | Method | Reference | Comment |
---|---|---|---|---|---|
ΔfH°gas | 150.0 ± 6.2 | kJ/mol | Review | Martinho Simões |

Condensed phase thermochemistry data

Data compiled by: José A. Martinho Simões
Quantity | Value | Units | Method | Reference | Comment |
---|---|---|---|---|---|
ΔfH°solid | 35.4 ± 4.7 | kJ/mol | Review | Martinho Simões | |
Quantity | Value | Units | Method | Reference | Comment |
ΔcH°solid | -8978.9 ± 4.2 | kJ/mol | CC-SB | Devyatykh, Rabinovich, et al., 1974 | Please also see Pedley and Rylance, 1977 and Tel'noi and Rabinovich, 1977. |

Gas phase ion energetics data

Data compiled as indicated in comments:
LLK - Sharon G. Lias, Rhoda D. Levin, and Sherif A. Kafafi
RDSH - Henry M. Rosenstock, Keith Draxl, Bruce W. Steiner, and John T. Herron
Ionization energy determinations
IE (eV) | Method | Reference | Comment |
---|---|---|---|
7.9 ± 0.3 | EI | Gaivoronskii, Gavrishchuk, et al., 1978 | LLK |
7.9 ± 0.3 | EI | Devyatykh, Krasnova, et al., 1970 | RDSH |
Appearance energy determinations
Ion | AE (eV) | Other Products | Method | Reference | Comment |
---|---|---|---|---|---|
C5H5La+ | 17.3 ± 0.3 | 2C5H5 | EI | Gaivoronskii, Gavrishchuk, et al., 1978 | LLK |
C5H5La+ | 17.3 ± 0.3 | ? | EI | Devyatykh, Krasnova, et al., 1970 | RDSH |
C10H10La+ | 10.2 ± 0.3 | C5H5 | EI | Gaivoronskii, Gavrishchuk, et al., 1978 | LLK |
C10H10La+ | 10.2 ± 0.3 | ? | EI | Devyatykh, Krasnova, et al., 1970 | RDSH |
La+ | 24.4 ± 0.4 | ? | EI | Devyatykh, Krasnova, et al., 1970 | RDSH |

Phase change data

Data compiled as indicated in comments:
AC - William E. Acree, Jr., James S. Chickos
MS - José A. Martinho Simões
Quantity | Value | Units | Method | Reference | Comment |
---|---|---|---|---|---|
ΔsubH° | 27.39 ± 0.96 | kcal/mol | N/A | Pilcher and Skinner, 1983 | See also Devyatykh, Rabinovitch, et al., 1974.; AC |
ΔsubH° | 27.39 ± 0.96 | kcal/mol | CC-SB | Devyatykh, Borisov, et al., 1972 | MS |
Enthalpy of sublimation
ΔsubH (kcal/mol) | Temperature (K) | Reference | Comment |
---|---|---|---|
24.40 ± 0.69 | 548. to 663. | Borisov, Krasnova, et al., 1973 | AC |

References

Martinho Simões
Martinho Simões, J.A.,
Private communication (see http://webbook.nist.gov/chemistry/om/). [all data]
Devyatykh, Rabinovich, et al., 1974
Devyatykh, C.G.; Rabinovich, I.B.; Tel'noi, V.I.; Borisov, G.K.; Zyazina, L.F.,
Dokl. Akad. Nauk SSSR, 1974, 217, 609. [all data]
Pedley and Rylance, 1977
Pedley, J.B.; Rylance, J.,
Computer Analysed Thermochemical Data: Organic and Organometallic Compounds, University of Sussex, Brigton, 1977. [all data]
Tel'noi and Rabinovich, 1977
Tel'noi, V.I.; Rabinovich, I.B.,
Russ. Chem. Rev., 1977, 46, 689. [all data]
Gaivoronskii, Gavrishchuk, et al., 1978
Gaivoronskii, P.E.; Gavrishchuk, E.M.; Chernyaev, N.P.; Zverev, Y.B.,
Mass spectrometric study of tris(isopropylcyclopentadienyl) π- complexes of lanthanum, praseodymium, and neodymium,
Russ. J. Inorg. Chem., 1978, 23, 1742. [all data]
Devyatykh, Krasnova, et al., 1970
Devyatykh, G.G.; Krasnova, S.G.; Borisov, G.K.; Larin, N.V.; Gaivoronskii, P.E.,
Preparation and investigation by mass spectrometry of cyclopentadienyl 7r-complexes of lanthanum, praseodymium, and neodymium,
Dokl. Akad. Nauk SSSR, 1970, 193, 1069, In original 580. [all data]