1,3-Dichlorotetrafluoroacetone
- Formula: C3Cl2F4O
- Molecular weight: 198.931
- IUPAC Standard InChIKey: QRKKTXWUDLJYCV-UHFFFAOYSA-N
- CAS Registry Number: 127-21-9
- Chemical structure:
View 3d structure (requires JavaScript / HTML 5) - Other names: 2-Propanone, 1,3-dichloro-1,1,3,3-tetrafluoro-; sym-Dichlorotetrafluoroacetone; Bis(chlorodifluoromethyl) ketone; DCTFA; Stauffer N-3,412; 1,1,3,3-Tetrafluoro-1,3-dichloroacetone; 1,3-Dichloro-1,1,3,3-tetrafluoroacetone; (CF2Cl)2CO; Dichlorotetrafluoroacetone; 1,3-Dichloro-1,1,3,3-tetrafluoro-2-propanone; 4FK; Acetone, 1,3-dichloro-1,1,3,3-tetrafluoroacetone; NSC 62662

Phase change data

Data compiled as indicated in comments:
BS - Robert L. Brown and Stephen E. Stein
TRC - Thermodynamics Research Center, NIST Boulder Laboratories, Chris Muzny director
Quantity | Value | Units | Method | Reference | Comment |
---|---|---|---|---|---|
Tboil | 317.7 | K | N/A | Aldrich Chemical Company Inc., 1990 | BS |
Tboil | 318. | K | N/A | PCR Inc., 1990 | BS |
Tboil | 318. | K | N/A | Gordon and Woolf, 1959 | Uncertainty assigned by TRC = 4. K; TRC |

Gas phase ion energetics data

Data compiled as indicated in comments:
LLK - Sharon G. Lias, Rhoda D. Levin, and Sherif A. Kafafi
RDSH - Henry M. Rosenstock, Keith Draxl, Bruce W. Steiner, and John T. Herron
Ionization energy determinations
IE (eV) | Method | Reference | Comment |
---|---|---|---|
10.71 ± 0.01 | PE | Cocksey, Eland, et al., 1971 | LLK |
Appearance energy determinations
Ion | AE (eV) | Other Products | Method | Reference | Comment |
---|---|---|---|---|---|
CFCl+ | 11.95 | ? | EI | Majer, Olavesen, et al., 1971 | LLK |
CF2Cl+ | 12.5 | ? | EI | Leyland, Majer, et al., 1970 | RDSH |

References

Aldrich Chemical Company Inc., 1990
Aldrich Chemical Company Inc.,
Catalog Handbook of Fine Chemicals, Aldrich Chemical Company, Inc., Milwaukee WI, 1990, 1. [all data]
PCR Inc., 1990
PCR Inc.,
Research Chemicals Catalog 1990-1991, PCR Inc., Gainesville, FL, 1990, 1. [all data]
Gordon and Woolf, 1959
Gordon, J.; Woolf, C.,
, 1959. [all data]
Cocksey, Eland, et al., 1971
Cocksey, B.J.; Eland, J.H.D.; Danby, C.J.,
The effect of alkyl substitution on ionisation potential,
J. Chem. Soc., 1971, (B), 790. [all data]
Majer, Olavesen, et al., 1971
Majer, J.R.; Olavesen, C.; Robb, J.C.,
Wavelength effect in the photolysis of halogenated ketones,
J. Chem. Soc. B, 1971, 48. [all data]
Leyland, Majer, et al., 1970
Leyland, L.M.; Majer, J.R.; Robb, J.C.,
Heat of formation of the CF2Cl. radical,
J. Chem. Soc. Faraday Trans., 1970, 66, 898. [all data]
Bowles, Majer, et al., 1962
Bowles, R.; Majer, J.R.; Robb, J.C.,
Photodecomposition of halogenated ketones. Part 1. The gas phase photolysis of 1,3-dichlorotetrafluoroacetone,
Trans. Faraday Soc., 1962, 58, 1541-1556. [all data]