N,N-Dimethylacetamide
- Formula: C4H9NO
- Molecular weight: 87.1204
- IUPAC Standard InChIKey: FXHOOIRPVKKKFG-UHFFFAOYSA-N
- CAS Registry Number: 127-19-5
- Chemical structure:
View 3d structure (requires JavaScript / HTML 5) - Other names: Acetamide, N,N-dimethyl-; Acetdimethylamide; Dimethylacetamide; Dimethylamide acetate; DMA; CH3CON(CH3)2; Acetic acid dimethylamide; Acetyl dimethylamine; CBC 510337; DMAc; Hallucinogen; N,N-Dimethylethanamide; NSC 3138; SK 7176; U-5954; Dimethylamid kyseliny octove

Condensed phase thermochemistry data

Data compiled as indicated in comments:
ALS - Hussein Y. Afeefy, Joel F. Liebman, and Stephen E. Stein
DH - Eugene S. Domalski and Elizabeth D. Hearing
Quantity | Value | Units | Method | Reference | Comment |
---|---|---|---|---|---|
ΔfH°liquid | -300.1 | kJ/mol | Cm | Guthrie, 1974 | Heat of hydrolysis; ALS |
ΔfH°liquid | -298.2 | kJ/mol | Ccb | Baroody and Carpenter, 1972 | ALS |
ΔfH°liquid | -278.3 ± 1.5 | kJ/mol | Ccb | Vasil'eva, Zhil'tsova, et al., 1972 | ALS |
Quantity | Value | Units | Method | Reference | Comment |
ΔcH°liquid | -2582.0 ± 1.5 | kJ/mol | Ccb | Vasil'eva, Zhil'tsova, et al., 1972 | ALS |
Constant pressure heat capacity of liquid
Cp,liquid (J/mol*K) | Temperature (K) | Reference | Comment |
---|---|---|---|
178.2 | 298.15 | De Visser, Heuvelsland, et al., 1978 | DH |

Phase change data

Data compiled as indicated in comments:
BS - Robert L. Brown and Stephen E. Stein
AC - William E. Acree, Jr., James S. Chickos
ALS - Hussein Y. Afeefy, Joel F. Liebman, and Stephen E. Stein
Quantity | Value | Units | Method | Reference | Comment |
---|---|---|---|---|---|
Tboil | 438.2 | K | N/A | Weast and Grasselli, 1989 | BS |
Quantity | Value | Units | Method | Reference | Comment |
ΔvapH° | 49. ± 7. | kJ/mol | AVG | N/A | Average of 7 values; Individual data points |
Enthalpy of vaporization
ΔvapH (kJ/mol) | Temperature (K) | Method | Reference | Comment |
---|---|---|---|---|
45.1 | 386. | A | Stephenson and Malanowski, 1987 | Based on data from 371. to 423. K.; AC |
45.2 | 318. | A | Stephenson and Malanowski, 1987 | Based on data from 303. to 363. K. See also Gopal and Rizvi, 1968.; AC |
67.9 | 312. | N/A | Myasinkova, Schmelev, et al., 1974 | Based on data from 297. to 438. K. See also Boublik, Fried, et al., 1984.; AC |
Antoine Equation Parameters
log10(P) = A − (B / (T + C))
P = vapor pressure (bar)
T = temperature (K)
View plot Requires a JavaScript / HTML 5 canvas capable browser.
Temperature (K) | A | B | C | Reference | Comment |
---|---|---|---|---|---|
303. to 363. | 6.09451 | 2725.96 | 28.209 | Gopal and Rizvi, 1968, 2 | Coefficents calculated by NIST from author's data. |
Enthalpy of fusion
ΔfusH (kJ/mol) | Temperature (K) | Reference | Comment |
---|---|---|---|
10.2 | 254.2 | Smirnova, Tsvetkova, et al., 2007 | AC |
8.2 | 253.2 | Lisicki and Jamróz, 2000 | AC |
10.42 | 251.4 | Ahlers, Lohmann, et al., 1999 | AC |

Reaction thermochemistry data

Data compiled as indicated in comments:
M - Michael M. Meot-Ner (Mautner) and Sharon G. Lias
B - John E. Bartmess
RCD - Robert C. Dunbar
ALS - Hussein Y. Afeefy, Joel F. Liebman, and Stephen E. Stein
Individual Reactions
By formula: C3H10N+ + C4H9NO = (C3H10N+ • C4H9NO)
Bond type: Hydrogen bonds of the type NH+-O between organics
Quantity | Value | Units | Method | Reference | Comment |
---|---|---|---|---|---|
ΔrH° | 114. | kJ/mol | PHPMS | Meot-Ner, 1984 | gas phase; M |
ΔrH° | 114. | kJ/mol | PHPMS | Meot-Ner, 1984, 2 | gas phase; M |
Quantity | Value | Units | Method | Reference | Comment |
ΔrS° | 101. | J/mol*K | PHPMS | Meot-Ner, 1984 | gas phase; M |
ΔrS° | 101. | J/mol*K | PHPMS | Meot-Ner, 1984, 2 | gas phase; M |
C4H8NO- + =
By formula: C4H8NO- + H+ = C4H9NO
Quantity | Value | Units | Method | Reference | Comment |
---|---|---|---|---|---|
ΔrH° | 1568. ± 8.8 | kJ/mol | G+TS | Bartmess, Scott, et al., 1979 | gas phase; value altered from reference due to change in acidity scale; B |
Quantity | Value | Units | Method | Reference | Comment |
ΔrG° | 1540. ± 8.4 | kJ/mol | IMRE | Bartmess, Scott, et al., 1979 | gas phase; value altered from reference due to change in acidity scale; B |
By formula: C4H10NO+ + C4H9NO = (C4H10NO+ • C4H9NO)
Bond type: Hydrogen bonds of the type OH-O between organics
Quantity | Value | Units | Method | Reference | Comment |
---|---|---|---|---|---|
ΔrH° | 131. | kJ/mol | PHPMS | Meot-Ner, 1984, 2 | gas phase; M |
Quantity | Value | Units | Method | Reference | Comment |
ΔrS° | 115. | J/mol*K | PHPMS | Meot-Ner, 1984, 2 | gas phase; M |
By formula: K+ + C4H9NO = (K+ • C4H9NO)
Quantity | Value | Units | Method | Reference | Comment |
---|---|---|---|---|---|
ΔrH° | 121. | kJ/mol | CIDT | Klassen, Anderson, et al., 1996 | RCD |
ΔrH° | 130. | kJ/mol | HPMS | Sunner, 1984 | gas phase; M |
Quantity | Value | Units | Method | Reference | Comment |
ΔrS° | 96. | J/mol*K | HPMS | Sunner, 1984 | gas phase; M |
By formula: (K+ • 2C4H9NO) + C4H9NO = (K+ • 3C4H9NO)
Quantity | Value | Units | Method | Reference | Comment |
---|---|---|---|---|---|
ΔrH° | 75. | kJ/mol | HPMS | Sunner, 1984 | gas phase; M |
Quantity | Value | Units | Method | Reference | Comment |
ΔrS° | 100. | J/mol*K | HPMS | Sunner, 1984 | gas phase; M |
By formula: (K+ • C4H9NO) + C4H9NO = (K+ • 2C4H9NO)
Quantity | Value | Units | Method | Reference | Comment |
---|---|---|---|---|---|
ΔrH° | 100. | kJ/mol | HPMS | Sunner, 1984 | gas phase; M |
Quantity | Value | Units | Method | Reference | Comment |
ΔrS° | 100. | J/mol*K | HPMS | Sunner, 1984 | gas phase; M |
By formula: C4H9NO = C4H9NO
Quantity | Value | Units | Method | Reference | Comment |
---|---|---|---|---|---|
ΔrH° | 67. ± 3. | kJ/mol | Eqk | Beak, Lee, et al., 1978 | liquid phase; ALS |
By formula: Na+ + C4H9NO = (Na+ • C4H9NO)
Quantity | Value | Units | Method | Reference | Comment |
---|---|---|---|---|---|
ΔrH° | 157. | kJ/mol | CIDT | Klassen, Anderson, et al., 1996 | RCD |

Gas phase ion energetics data

Data evaluated as indicated in comments:
HL - Edward P. Hunter and Sharon G. Lias
Data compiled as indicated in comments:
B - John E. Bartmess
LLK - Sharon G. Lias, Rhoda D. Levin, and Sherif A. Kafafi
RDSH - Henry M. Rosenstock, Keith Draxl, Bruce W. Steiner, and John T. Herron
Quantity | Value | Units | Method | Reference | Comment |
---|---|---|---|---|---|
Proton affinity (review) | 908.0 | kJ/mol | N/A | Hunter and Lias, 1998 | HL |
Quantity | Value | Units | Method | Reference | Comment |
Gas basicity | 877.0 | kJ/mol | N/A | Hunter and Lias, 1998 | HL |
Ionization energy determinations
IE (eV) | Method | Reference | Comment |
---|---|---|---|
9.20 ± 0.05 | EI | Baldwin, Loudon, et al., 1977 | LLK |
8.81 | CTS | Slifkin and Allison, 1967 | RDSH |
8.81 ± 0.03 | PI | Watanabe, Nakayama, et al., 1962 | RDSH |
9.43 | PE | Sweigart and Turner, 1972 | Vertical value; LLK |
Appearance energy determinations
Ion | AE (eV) | Other Products | Method | Reference | Comment |
---|---|---|---|---|---|
C2H3O+ | 12.55 | ? | EI | Loudon and Webb, 1977 | LLK |
C2H3O+ | 11.4 ± 0.1 | ? | EI | Gowenlock, Jones, et al., 1961 | RDSH |
C2H6N+ | 12.15 | ? | EI | Loudon and Webb, 1977 | LLK |
C2H6N+ | 12.4 ± 0.1 | ? | EI | Gowenlock, Jones, et al., 1961 | RDSH |
C3H6NO+ | 11.60 | ? | EI | Loudon and Webb, 1977 | LLK |
De-protonation reactions
C4H8NO- + =
By formula: C4H8NO- + H+ = C4H9NO
Quantity | Value | Units | Method | Reference | Comment |
---|---|---|---|---|---|
ΔrH° | 1568. ± 8.8 | kJ/mol | G+TS | Bartmess, Scott, et al., 1979 | gas phase; value altered from reference due to change in acidity scale; B |
Quantity | Value | Units | Method | Reference | Comment |
ΔrG° | 1540. ± 8.4 | kJ/mol | IMRE | Bartmess, Scott, et al., 1979 | gas phase; value altered from reference due to change in acidity scale; B |

Ion clustering data

Data compiled as indicated in comments:
M - Michael M. Meot-Ner (Mautner) and Sharon G. Lias
RCD - Robert C. Dunbar
Clustering reactions
By formula: C3H10N+ + C4H9NO = (C3H10N+ • C4H9NO)
Bond type: Hydrogen bonds of the type NH+-O between organics
Quantity | Value | Units | Method | Reference | Comment |
---|---|---|---|---|---|
ΔrH° | 114. | kJ/mol | PHPMS | Meot-Ner, 1984 | gas phase; M |
ΔrH° | 114. | kJ/mol | PHPMS | Meot-Ner, 1984, 2 | gas phase; M |
Quantity | Value | Units | Method | Reference | Comment |
ΔrS° | 101. | J/mol*K | PHPMS | Meot-Ner, 1984 | gas phase; M |
ΔrS° | 101. | J/mol*K | PHPMS | Meot-Ner, 1984, 2 | gas phase; M |
By formula: C4H10NO+ + C4H9NO = (C4H10NO+ • C4H9NO)
Bond type: Hydrogen bonds of the type OH-O between organics
Quantity | Value | Units | Method | Reference | Comment |
---|---|---|---|---|---|
ΔrH° | 131. | kJ/mol | PHPMS | Meot-Ner, 1984, 2 | gas phase; M |
Quantity | Value | Units | Method | Reference | Comment |
ΔrS° | 115. | J/mol*K | PHPMS | Meot-Ner, 1984, 2 | gas phase; M |
By formula: K+ + C4H9NO = (K+ • C4H9NO)
Quantity | Value | Units | Method | Reference | Comment |
---|---|---|---|---|---|
ΔrH° | 121. | kJ/mol | CIDT | Klassen, Anderson, et al., 1996 | RCD |
ΔrH° | 130. | kJ/mol | HPMS | Sunner, 1984 | gas phase; M |
Quantity | Value | Units | Method | Reference | Comment |
ΔrS° | 96. | J/mol*K | HPMS | Sunner, 1984 | gas phase; M |
By formula: (K+ • C4H9NO) + C4H9NO = (K+ • 2C4H9NO)
Quantity | Value | Units | Method | Reference | Comment |
---|---|---|---|---|---|
ΔrH° | 100. | kJ/mol | HPMS | Sunner, 1984 | gas phase; M |
Quantity | Value | Units | Method | Reference | Comment |
ΔrS° | 100. | J/mol*K | HPMS | Sunner, 1984 | gas phase; M |
By formula: (K+ • 2C4H9NO) + C4H9NO = (K+ • 3C4H9NO)
Quantity | Value | Units | Method | Reference | Comment |
---|---|---|---|---|---|
ΔrH° | 75. | kJ/mol | HPMS | Sunner, 1984 | gas phase; M |
Quantity | Value | Units | Method | Reference | Comment |
ΔrS° | 100. | J/mol*K | HPMS | Sunner, 1984 | gas phase; M |
By formula: Na+ + C4H9NO = (Na+ • C4H9NO)
Quantity | Value | Units | Method | Reference | Comment |
---|---|---|---|---|---|
ΔrH° | 157. | kJ/mol | CIDT | Klassen, Anderson, et al., 1996 | RCD |

Kovats' RI, non-polar column, temperature ramp

Column type | Active phase | I | Reference | Comment |
---|---|---|---|---|
Capillary | OV-101 | 820. | Ohnishi and Shibamoto, 1984 | 2. K/min; Column length: 50. m; Column diameter: 0.23 mm; Tstart: 80. C; Tend: 200. C |

Van Den Dool and Kratz RI, non-polar column, temperature ramp

Column type | Active phase | I | Reference | Comment |
---|---|---|---|---|
Capillary | SPB-Sulfur | 833.3 | de Lacy Costello, Evans, et al., 2001 | 30. m/0.32 mm/4. μm, 40. C @ 12.5 min, 4. K/min; Tend: 200. C |

Van Den Dool and Kratz RI, polar column, temperature ramp

Column type | Active phase | I | Reference | Comment |
---|---|---|---|---|
Capillary | DB-Wax | 1414. | Shimoda, Shigematsu, et al., 1995 | 60. m/0.25 mm/0.25 μm, 2. K/min; Tstart: 50. C; Tend: 230. C |

Normal alkane RI, non-polar column, temperature ramp

Column type | Active phase | I | Reference | Comment |
---|---|---|---|---|
Capillary | OV-101 | 833. | Zenkevich, 2005 | 25. m/0.20 mm/0.10 μm, N2/He, 6. K/min; Tstart: 50. C; Tend: 250. C |

Normal alkane RI, non-polar column, custom temperature program

Column type | Active phase | I | Reference | Comment |
---|---|---|---|---|
Capillary | DB-5 MS | 883. | Luo and Agnew, 2001 | 30. m/0.25 mm/1.0 μm, Helium; Program: not specified |
Capillary | SPB-1 | 835. | Flanagan, Streete, et al., 1997 | 60. m/0.53 mm/5. μm, He; Program: 40C(6min) => 5C/min => 80C => 10C/min => 200C |
Capillary | SPB-1 | 835. | Strete, Ruprah, et al., 1992 | 60. m/0.53 mm/5.0 μm, Helium; Program: 40 0C (6 min) 5 0C/min -> 80 0C 10 0C/min -> 200 0C |
Capillary | Methyl Silicone | 840. | Zenkevich and Kuznetsova, 1990 | Program: not specified |

Normal alkane RI, polar column, temperature ramp

Column type | Active phase | I | Reference | Comment |
---|---|---|---|---|
Capillary | DB-Wax | 1437. | Shimadzu, 2012 | 30. m/0.32 mm/0.50 μm, Helium, 4. K/min; Tstart: 40. C; Tend: 260. C |
Capillary | DB-Wax | 1437. | Shimadzu Corporation, 2003 | 30. m/0.32 mm/0.5 μm, He, 4. K/min; Tstart: 40. C; Tend: 260. C |

Normal alkane RI, polar column, custom temperature program

Column type | Active phase | I | Reference | Comment |
---|---|---|---|---|
Capillary | DB-Wax | 1384. | Peng, Yang, et al., 1991 | Program: not specified |
Capillary | DB-Wax | 1409. | Peng, Yang, et al., 1991 | Program: not specified |

References

Guthrie, 1974
Guthrie, J.P.,
Hydration of carboxamides. Evaluation of the free energy change for addition of water to acetamide and formamide derivatives,
J. Am. Chem. Soc., 1974, 96, 3608-3615. [all data]
Baroody and Carpenter, 1972
Baroody, E.E.; Carpenter, G.A.,
Heats of formation of propellant compounds (U), Rpt. Naval Ordnance Systems Command Task No. 331-003/067-1/UR2402-001 for Naval Ordance Station, Indian Head, MD, 1972, 1-9. [all data]
Vasil'eva, Zhil'tsova, et al., 1972
Vasil'eva, T.F.; Zhil'tsova, E.N.; Vvedenskii, A.A.,
Enthalpies of combustion of NN-dimethylformamide and NN-dimethylacetamide,
Russ. J. Phys. Chem. (Engl. Transl.), 1972, 46, 315. [all data]
De Visser, Heuvelsland, et al., 1978
De Visser, C.; Heuvelsland, W.J.M.; Dunn, L.A.; Somsen, G.,
Some properties of binary aqueous liquid mixtures, J. Chem. Soc.,
Faraday Trans.1, 1978, 74, 1159-1169. [all data]
Weast and Grasselli, 1989
CRC Handbook of Data on Organic Compounds, 2nd Editon, Weast,R.C and Grasselli, J.G., ed(s)., CRC Press, Inc., Boca Raton, FL, 1989, 1. [all data]
Stephenson and Malanowski, 1987
Stephenson, Richard M.; Malanowski, Stanislaw,
Handbook of the Thermodynamics of Organic Compounds, 1987, https://doi.org/10.1007/978-94-009-3173-2
. [all data]
Gopal and Rizvi, 1968
Gopal, R.; Rizvi, S.A.,
J. Indian Chem. Soc., 1968, 45, 1, 13. [all data]
Myasinkova, Schmelev, et al., 1974
Myasinkova, L.F.; Schmelev, V.A.; Vaisman, I.L.; Bushinskii, V.I.; Novokhatka, D.A.,
Zh. Prikl. Khim. (Leningrad), 1974, 47, 2604. [all data]
Boublik, Fried, et al., 1984
Boublik, T.; Fried, V.; Hala, E.,
The Vapour Pressures of Pure Substances: Selected Values of the Temperature Dependence of the Vapour Pressures of Some Pure Substances in the Normal and Low Pressure Region, 2nd ed., Elsevier, New York, 1984, 972. [all data]
Gopal and Rizvi, 1968, 2
Gopal, R.; Rizvi, S.A.,
Vapour Pressures of Some Mono- and Di-Alkyl Substituted Aliphatic Amides at Different Temperatures,
J. Indian Chem. Soc., 1968, 45, 1, 13-16. [all data]
Smirnova, Tsvetkova, et al., 2007
Smirnova, N.N.; Tsvetkova, L.Ya.; Bykova, T.A.; Marcus, Yizhak,
Thermodynamic properties of N,N-dimethylformamide and N,N-dimethylacetamide,
The Journal of Chemical Thermodynamics, 2007, 39, 11, 1508-1513, https://doi.org/10.1016/j.jct.2007.02.009
. [all data]
Lisicki and Jamróz, 2000
Lisicki, Zygmunt; Jamróz, Malgorzata E.,
(Solid + liquid) equilibria in (polynuclear aromatic+ tertiary amide) systems,
The Journal of Chemical Thermodynamics, 2000, 32, 10, 1335-1353, https://doi.org/10.1006/jcht.2000.0685
. [all data]
Ahlers, Lohmann, et al., 1999
Ahlers, Jens; Lohmann, Jürgen; Gmehling, Jürgen,
Binary Solid-Liquid Equilibria of Organic Systems Containing Different Amides and Sulfolane,
J. Chem. Eng. Data, 1999, 44, 4, 727-730, https://doi.org/10.1021/je9802975
. [all data]
Meot-Ner, 1984
Meot-Ner, (Mautner)M.,
The Ionic Hydrogen Bond and Ion Solvation. 1. -NH+ O-, -NH+ N- and -OH+ O- Bonds. Correlations with Proton Affinity. Deviations Due to Structural Effects,
J. Am. Chem. Soc., 1984, 106, 5, 1257, https://doi.org/10.1021/ja00317a015
. [all data]
Meot-Ner, 1984, 2
Meot-Ner, (Mautner),
The Ionic Hydrogen Bond. 4. Intramolecular and Multiple Bonds. Proton Affinities, Hydration and Complexes of Amides and Amino Acid Derivatives,
J. Am. Chem. Soc., 1984, 106, 2, 278, https://doi.org/10.1021/ja00314a003
. [all data]
Bartmess, Scott, et al., 1979
Bartmess, J.E.; Scott, J.A.; McIver, R.T., Jr.,
The gas phase acidity scale from methanol to phenol,
J. Am. Chem. Soc., 1979, 101, 6047. [all data]
Klassen, Anderson, et al., 1996
Klassen, J.S.; Anderson, S.G.; Blades, A.T.; Kebarle, P.,
Reaction Enthalpies for M+L = M+ + L, Where M+ = Na+ and K+ and L = Acetamide, N-Methylacetamide, N,N-Dimethylacetamide, Glycine, and Glycylglycine, from Determinations of the Collision-Induced Dissociation Thresholds,
J. Phys. Chem., 1996, 100, 33, 14218, https://doi.org/10.1021/jp9608382
. [all data]
Sunner, 1984
Sunner, J. Kebarle,
Ion - Solvent Molecule Interactions in the Gas Phase. The Potassium Ion and Me2SO, DMA, DMF, and Acetone,
J. Am. Chem. Soc., 1984, 106, 21, 6135, https://doi.org/10.1021/ja00333a002
. [all data]
Beak, Lee, et al., 1978
Beak, P.; Lee, J.-K.; Zeigler, J.M.,
Equilibration studies: amide-imidate and thioamide-thioimidate functions,
J. Org. Chem., 1978, 43, 1536-1538. [all data]
Hunter and Lias, 1998
Hunter, E.P.; Lias, S.G.,
Evaluated Gas Phase Basicities and Proton Affinities of Molecules: An Update,
J. Phys. Chem. Ref. Data, 1998, 27, 3, 413-656, https://doi.org/10.1063/1.556018
. [all data]
Baldwin, Loudon, et al., 1977
Baldwin, M.A.; Loudon, A.G.; Webb, K.S.; Cardnell, P.C.,
Charge location and fragmentation under electron impact. V-The ionization potentials of (methylated) phosphoramides, guanidines, formamides, acetamides, ureas and thioureas,
Org. Mass Spectrom., 1977, 12, 279. [all data]
Slifkin and Allison, 1967
Slifkin, M.A.; Allison, A.C.,
Measurement of ionization potentials from contact charge transfer spectra,
Nature, 1967, 215, 949. [all data]
Watanabe, Nakayama, et al., 1962
Watanabe, K.; Nakayama, T.; Mottl, J.,
Ionization potentials of some molecules,
J. Quant. Spectry. Radiative Transfer, 1962, 2, 369. [all data]
Sweigart and Turner, 1972
Sweigart, D.A.; Turner, D.W.,
Lone pair orbitals and their interactions studied by photoelectron spectroscopy. I. Carboxylic acids and their derivatives,
J. Am. Chem. Soc., 1972, 94, 5592. [all data]
Loudon and Webb, 1977
Loudon, A.G.; Webb, K.S.,
The nature of the [C2H6N]+ and [CH4N]+ ions formed by electron impact on methylated formamides, acetamides, ureas, thioureas and hexamethylphosphoramide,
Org. Mass Spectrom., 1977, 12, 283. [all data]
Gowenlock, Jones, et al., 1961
Gowenlock, B.G.; Jones, P.P.; Majer, J.R.,
Bond dissociation energies in some molecules containing alkyl substituted CH3, NH2, and OH,
J. Chem. Soc. Faraday Trans., 1961, 57, 23. [all data]
Ohnishi and Shibamoto, 1984
Ohnishi, S.; Shibamoto, T.,
Volatile compounds from heated beef fat and beef fat with glycine,
J. Agric. Food Chem., 1984, 32, 5, 987-992, https://doi.org/10.1021/jf00125a008
. [all data]
de Lacy Costello, Evans, et al., 2001
de Lacy Costello, B.P.J.; Evans, P.; Ewen, R.J.; Gunson, H.E.; Jones, P.R.H.; Ratcliffe, N.M.; Spencer-Phillips, P.T.N.,
Gas chromatography-mass spectrometry analyses of volatile organic compounds from potato tubers inoculated with Phytophthora infestans or Fusarium coeruleum,
Plant Pathol., 2001, 50, 4, 489-496, https://doi.org/10.1046/j.1365-3059.2001.00594.x
. [all data]
Shimoda, Shigematsu, et al., 1995
Shimoda, M.; Shigematsu, H.; Shiratsuchi, H.; Osajima, Y.,
Comparison of the odor concentrates by SDE and adsorptive column method from green tea infusion,
J. Agric. Food Chem., 1995, 43, 6, 1616-1620, https://doi.org/10.1021/jf00054a037
. [all data]
Zenkevich, 2005
Zenkevich, I.G.,
Experimentally measured retention indices., 2005. [all data]
Luo and Agnew, 2001
Luo, J.; Agnew, M.P.,
Gas characteristics before and after biofiltration treating odorous emissions from animal rendering processes,
Environ. Technol., 2001, 22, 9, 1091-1103, https://doi.org/10.1080/09593332208618220
. [all data]
Flanagan, Streete, et al., 1997
Flanagan, R.J.; Streete, P.J.; Ramsey, J.D.,
Volatile Substance Abuse, UNODC Technical Series, No 5, United Nations, Office on Drugs and Crime, Vienna International Centre, PO Box 500, A-1400 Vienna, Austria, 1997, 56, retrieved from http://www.odccp.org/pdf/technicalseries1997-01-011.pdf. [all data]
Strete, Ruprah, et al., 1992
Strete, P.J.; Ruprah, M.; Ramsey, J.D.; Flanagan, R.J.,
Detection and identification of volatile substances by headspace capillary gas chromatography to aid the diagnosis of acute poisoning,
Analyst, 1992, 117, 7, 1111-1127, https://doi.org/10.1039/an9921701111
. [all data]
Zenkevich and Kuznetsova, 1990
Zenkevich, I.G.; Kuznetsova, L.M.,
Logic Criteria on Prediction of Gas Chromatographic Retention Indices from Physico-Chemical Properties of Organic Compounds,
Dokl. Akad. Nauk SSSR, 1990, 315, 4, 881-885. [all data]
Shimadzu, 2012
Shimadzu, Pharmaceutical Related,
Analysis of pharmaceutical residual solvent (observation of separation) (1) - GC, 2012, retrieved from www.shimadzu.ru/applications/Applicationspdf/GC/Pharma/Pharmaceutical residual solvents GC.pdf. [all data]
Shimadzu Corporation, 2003
Shimadzu Corporation,
Analysis of pharmaceutical residual solvent (observation of separation), 2003, retrieved from http://www.shimadzu.com.br/analitica/aplicacoes/book/pharm69.pdf. [all data]
Peng, Yang, et al., 1991
Peng, C.T.; Yang, Z.C.; Ding, S.F.,
Prediction of rentention idexes. II. Structure-retention index relationship on polar columns,
J. Chromatogr., 1991, 586, 1, 85-112, https://doi.org/10.1016/0021-9673(91)80028-F
. [all data]