Propanoic acid, 2-oxo-
- Formula: C3H4O3
- Molecular weight: 88.0621
- IUPAC Standard InChIKey: LCTONWCANYUPML-UHFFFAOYSA-N
- CAS Registry Number: 127-17-3
- Chemical structure:
View 3d structure (requires JavaScript / HTML 5) - Other names: Pyruvic acid; α-Ketopropionic acid; Acetylformic acid; BTS; Pyroracemic Acid; 2-Oxopropanoic acid; 2-Oxopropionic acid; CH3COCOOH

Condensed phase thermochemistry data

Data compiled by: Hussein Y. Afeefy, Joel F. Liebman, and Stephen E. Stein
Quantity | Value | Units | Method | Reference | Comment |
---|---|---|---|---|---|
ΔcH°liquid | -1165.3 | kJ/mol | Ccb | Blaschko, 1925 | Heat of combustion corrected for pressure; Corresponding ΔfHºliquid = -586.85 kJ/mol (simple calculation by NIST; no Washburn corrections) |
Quantity | Value | Units | Method | Reference | Comment |
ΔcH°solid | -1166.4 | kJ/mol | Ccb | Meyerhof, Lohmann, et al., 1925 | Corresponding ΔfHºsolid = -585.76 kJ/mol (simple calculation by NIST; no Washburn corrections) |

Phase change data

Data compiled as indicated in comments:
BS - Robert L. Brown and Stephen E. Stein
AC - William E. Acree, Jr., James S. Chickos
Quantity | Value | Units | Method | Reference | Comment |
---|---|---|---|---|---|
Tboil | 438.2 | K | N/A | Aldrich Chemical Company Inc., 1990 | BS |
Enthalpy of vaporization
ΔvapH (kJ/mol) | Temperature (K) | Method | Reference | Comment |
---|---|---|---|---|
51.4 | 309. | A | Stephenson and Malanowski, 1987 | Based on data from 294. to 438. K. See also Stull, 1947.; AC |
Antoine Equation Parameters
log10(P) = A − (B / (T + C))
P = vapor pressure (bar)
T = temperature (K)
View plot Requires a JavaScript / HTML 5 canvas capable browser.
Temperature (K) | A | B | C | Reference | Comment |
---|---|---|---|---|---|
294.6 to 438. | 5.07991 | 2015.122 | -41.227 | Stull, 1947 | Coefficents calculated by NIST from author's data. |

Reaction thermochemistry data

Data compiled by: John E. Bartmess
Individual Reactions
C3H3O3- + =
By formula: C3H3O3- + H+ = C3H4O3
Quantity | Value | Units | Method | Reference | Comment |
---|---|---|---|---|---|
ΔrH° | 1395. ± 12. | kJ/mol | G+TS | Graul, Schnute, et al., 1990 | gas phase |
Quantity | Value | Units | Method | Reference | Comment |
ΔrG° | 1366. ± 12. | kJ/mol | CIDC | Graul, Schnute, et al., 1990 | gas phase |

Henry's Law data

Data compiled by: Rolf Sander
Henry's Law constant (water solution)
kH(T) = k°H exp(d(ln(kH))/d(1/T) ((1/T) - 1/(298.15 K)))
k°H = Henry's law constant for solubility in water at 298.15 K (mol/(kg*bar))
d(ln(kH))/d(1/T) = Temperature dependence constant (K)
k°H (mol/(kg*bar)) | d(ln(kH))/d(1/T) (K) | Method | Reference |
---|---|---|---|
300000. | 5200. | Q | N/A |
310000. | 5100. | M | N/A |

Gas phase ion energetics data

Data compiled as indicated in comments:
B - John E. Bartmess
LLK - Sharon G. Lias, Rhoda D. Levin, and Sherif A. Kafafi
LL - Sharon G. Lias and Joel F. Liebman
LBLHLM - Sharon G. Lias, John E. Bartmess, Joel F. Liebman, John L. Holmes, Rhoda D. Levin, and W. Gary Mallard
Ionization energy determinations
IE (eV) | Method | Reference | Comment |
---|---|---|---|
9.9 | PE | McGlynn and Meeks, 1975 | LLK |
10.42 | PE | McGlynn and Meeks, 1975 | Vertical value; LLK |
Appearance energy determinations
Ion | AE (eV) | Other Products | Method | Reference | Comment |
---|---|---|---|---|---|
CHO2+ | 10.28 | C2H3O | EI | Holmes, Lossing, et al., 1991 | LL |
C2H4O+ | 10.4 | CO2 | EI | Terlouw, Wezenberg, et al., 1983 | LBLHLM |
C2H4O+ | 10.7 ± 0.2 | CO2 | EI | Terlouw, Wezenberg, et al., 1983 | LBLHLM |
De-protonation reactions
C3H3O3- + =
By formula: C3H3O3- + H+ = C3H4O3
Quantity | Value | Units | Method | Reference | Comment |
---|---|---|---|---|---|
ΔrH° | 1395. ± 12. | kJ/mol | G+TS | Graul, Schnute, et al., 1990 | gas phase; B |
Quantity | Value | Units | Method | Reference | Comment |
ΔrG° | 1366. ± 12. | kJ/mol | CIDC | Graul, Schnute, et al., 1990 | gas phase; B |

Normal alkane RI, non-polar column, custom temperature program

Column type | Active phase | I | Reference | Comment |
---|---|---|---|---|
Other | Methyl Silicone | 1249. | Ardrey and Moffat, 1981 | Program: not specified |

References

Blaschko, 1925
Blaschko, H.,
Uber die Verbrennungswarme der Brenztraubensaure und ihre physiologische Bedeutung,
Biochem. Z., 1925, 158, 428-434. [all data]
Meyerhof, Lohmann, et al., 1925
Meyerhof, O.; Lohmann, K.; Meier, R.,
Synthesis of carbohydrate in muscle,
Biochem. Z., 1925, 157, 459-491. [all data]
Aldrich Chemical Company Inc., 1990
Aldrich Chemical Company Inc.,
Catalog Handbook of Fine Chemicals, Aldrich Chemical Company, Inc., Milwaukee WI, 1990, 1. [all data]
Stephenson and Malanowski, 1987
Stephenson, Richard M.; Malanowski, Stanislaw,
Handbook of the Thermodynamics of Organic Compounds, 1987, https://doi.org/10.1007/978-94-009-3173-2
. [all data]
Stull, 1947
Stull, Daniel R.,
Vapor Pressure of Pure Substances. Organic and Inorganic Compounds,
Ind. Eng. Chem., 1947, 39, 4, 517-540, https://doi.org/10.1021/ie50448a022
. [all data]
Graul, Schnute, et al., 1990
Graul, S.T.; Schnute, M.E.; Squires, R.R.,
Gas-Phase Acidities of Carboxylic Acids and Alcohols from Collision-Induced Dissociation of Dimer Cluster Ions,
Int. J. Mass Spectrom. Ion Proc., 1990, 96, 2, 181, https://doi.org/10.1016/0168-1176(90)87028-F
. [all data]
McGlynn and Meeks, 1975
McGlynn, S.P.; Meeks, J.L.,
Photoelectron spectra of carbonyls: Acetaldehyde, acetamide, biacetyl, pyruvic acid, methyl pyruvate and vamide,
J. Electron Spectrosc. Relat. Phenom., 1975, 6, 269. [all data]
Holmes, Lossing, et al., 1991
Holmes, J.L.; Lossing, F.P.; Mayer, P.M.,
Heats of formation of oxygen-containing organic free radicals from appearance energy measurements,
J. Am. Chem. Soc., 1991, 113, 9723. [all data]
Terlouw, Wezenberg, et al., 1983
Terlouw, J.K.; Wezenberg, J.; Burgers, P.C.; Holmes, J.L.,
New stable isomers of [C2H4O]+ and [C2H4O2]+, the radical cations [CH2COH]+ and [CH3OCOH]+,
J. Chem. Soc., Chem. Commun., 1983, 1121. [all data]
Ardrey and Moffat, 1981
Ardrey, R.E.; Moffat, A.C.,
Gas-liquid chromatographic retention indices of 1318 substances of toxicological interest on SE-30 or OV-1 stationary phase,
J. Chromatogr., 1981, 220, 3, 195-252, https://doi.org/10.1016/S0021-9673(00)81925-1
. [all data]