Methyl ferrocene
- Formula: C11H12Fe
- Molecular weight: 200.058
- IUPAC Standard InChIKey: FXXFJMZMTLWVNL-UHFFFAOYSA-N
- CAS Registry Number: 1271-44-9
- Chemical structure:
View 3d structure (requires JavaScript / HTML 5) - Other names: Cyclopentadienyl(methylcyclopentadienyl)iron

Gas phase ion energetics data

Data compiled by: Henry M. Rosenstock, Keith Draxl, Bruce W. Steiner, and John T. Herron
Ionization energy determinations
IE (eV) | Method | Reference |
---|---|---|
6.76 | CTS | Huttner and Fischer, 1967 |

References

Huttner and Fischer, 1967
Huttner, G.; Fischer, E.O.,
Uber Aromatenkomplexe von Metallen. XCVIII. Spectroskopische Untersuchungen an Charge-Transfer-Komplexen von Aromaten-Chrom Tricarbonylen mit 1,3,5-Trinitrobenzol,
J. Organometal. Chem., 1967, 8, 299. [all data]