Bis(η5-cyclopentadienyl)tungsten dihydride
- Formula: C10H12W
- Molecular weight: 316.04
- CAS Registry Number: 1271-33-6

Gas phase thermochemistry data

Data compiled by: José A. Martinho Simões
Quantity | Value | Units | Method | Reference | Comment |
---|---|---|---|---|---|
ΔfH°gas | 334.5 ± 3.3 | kJ/mol | Review | Martinho Simões | |
ΔfH°gas | 310.3 ± 8.7 | kJ/mol | Review | Martinho Simões | The enthalpy of formation relies on -63.1 ± 7.2 kJ/mol for the enthalpy of formation of W(Cp)2(Cl)2(cr) |

Condensed phase thermochemistry data

Data compiled by: José A. Martinho Simões
Quantity | Value | Units | Method | Reference | Comment |
---|---|---|---|---|---|
ΔfH°solid | 250.4 ± 2.9 | kJ/mol | Review | Martinho Simões | |
ΔfH°solid | 226.2 ± 8.6 | kJ/mol | Review | Martinho Simões | The enthalpy of formation relies on -63.1 ± 7.2 kJ/mol for the enthalpy of formation of W(Cp)2(Cl)2(cr) |
Quantity | Value | Units | Method | Reference | Comment |
ΔcH°solid | -6743.4 ± 2.5 | kJ/mol | CC-SB | Tel'noi, Rabinovich, et al., 1976 | Please also see Tel'noi and Rabinovich, 1977. |

Gas phase ion energetics data

Data compiled as indicated in comments:
LLK - Sharon G. Lias, Rhoda D. Levin, and Sherif A. Kafafi
RDSH - Henry M. Rosenstock, Keith Draxl, Bruce W. Steiner, and John T. Herron
Ionization energy determinations
IE (eV) | Method | Reference | Comment |
---|---|---|---|
6.4 ± 0.2 | LE | Nakato, Chiyoda, et al., 1974 | LLK |
6.5 ± 0.1 | EI | Muller and D'Or, 1967 | RDSH |
6.4 ± 0.1 | PE | Green, Jackson, et al., 1975 | Vertical value; LLK |

Reaction thermochemistry data

Data compiled by: José A. Martinho Simões

Individual Reactions

C10H12W (cr) + 2Iodine (cr) = C10H10I2W (cr) + 2Hydrogen iodide (g)

By formula: C10H12W (cr) + 2I2 (cr) = C10H10I2W (cr) + 2HI (g)

Quantity Value Units Method Reference Comment
Δr-104.3 ± 5.5kJ/molRSCCalado, Dias, et al., 1979

C10H12W (cr) + 2Carbon tetrabromide (cr) = C10H10Br2W (cr) + 2Methane, tribromo- (l)

By formula: C10H12W (cr) + 2CBr4 (cr) = C10H10Br2W (cr) + 2CHBr3 (l)

Quantity Value Units Method Reference Comment
Δr-302.5 ± 2.2kJ/molRSCCalado, Dias, et al., 1980

C10H12W (cr) + 2Carbon Tetrachloride (l) = C10H10Cl2W (cr) + 2Trichloromethane (l)

By formula: C10H12W (cr) + 2CCl4 (l) = C10H10Cl2W (cr) + 2CHCl3 (l)

Quantity Value Units Method Reference Comment
Δr-301.1 ± 3.4kJ/molRSCCalado, Dias, et al., 1979, 2

Phase change data

Data compiled as indicated in comments:
MS - José A. Martinho Simões
AC - William E. Acree, Jr., James S. Chickos

Quantity Value Units Method Reference Comment
Δsub20.1 ± 0.38kcal/molCC-SBDias, Diogo, et al., 1990Another value for the enthalpy of sublimation has been reported: 23.0 ± 0.50 kcal/mol Tel'noi, Rabinovich, et al., 1976; MS
Δsub23.0 ± 0.50kcal/molN/APilcher and Skinner, 1983See also Calado, Dias, et al., 1979 and Tel'noi, Rabinovich, et al., 1976.; AC

Enthalpy of sublimation

ΔsubH (kcal/mol) Temperature (K) Method Reference Comment
20.2 ± 0.38313. - 323.MEDias, Diogo, et al., 1990, 2AC

References

Martinho Simões
Martinho Simões, J.A.,
Private communication (see http://webbook.nist.gov/chemistry/om/). [all data]
Tel'noi, Rabinovich, et al., 1976
Tel'noi, V.I.; Rabinovich, I.B.; Kir'yanov, K.V.; Smirnov, A.S.,
Dokl. Akad. Nauk SSSR, 1976, 231, 733. [all data]
Tel'noi and Rabinovich, 1977
Tel'noi, V.I.; Rabinovich, I.B.,
Russ. Chem. Rev., 1977, 46, 689. [all data]
Nakato, Chiyoda, et al., 1974
Nakato, Y.; Chiyoda, T.; Tsubomura, H.,
Experimental determination of ionization potentials of organic amines, β-carotene and chlorophyll a,
Bull. Chem. Soc. Jpn., 1974, 47, 3001. [all data]
Muller and D'Or, 1967
Muller, J.; D'Or, L.,
Massenspektrometrische Untersuchungen an Dicyclopentadienylkomplexen von Ubergangsmetallen,
J.Organometal. Chem., 1967, 10, 313. [all data]
Green, Jackson, et al., 1975
Green, J.C.; Jackson, S.E.; Higginson, B.,
Photoelectron studies of some bent bis(n-cyclopentadienyl)metal complexes. Part I. Some eighteen-electron systems with hydride, alkyl, olefin, allyl, carbonyl ligands,
J. Chem. Soc. Dalton Trans., 1975, 403. [all data]