Titanocene dichloride
- Formula: C10H10Cl2Ti
- Molecular weight: 248.959
- IUPAC Standard InChIKey: XKLWATAZDMHTSH-UHFFFAOYSA-L
- CAS Registry Number: 1271-19-8
- Chemical structure:

Gas phase thermochemistry data

Data compiled by: José A. Martinho Simões
Quantity | Value | Units | Method | Reference | Comment |
---|---|---|---|---|---|
ΔfH°gas | -264.8 ± 8.0 | kJ/mol | Review | Martinho Simões | Selected data. |
ΔfH°gas | -542. ± 21. | kJ/mol | Review | Martinho Simões | |
ΔfH°gas | -564. ± 21. | kJ/mol | Review | Martinho Simões |

Condensed phase thermochemistry data

Data compiled by: José A. Martinho Simões
Quantity | Value | Units | Method | Reference | Comment |
---|---|---|---|---|---|
ΔfH°solid | -383.6 ± 7.7 | kJ/mol | Review | Martinho Simões | Selected data. |
ΔfH°solid | -639. ± 21. | kJ/mol | Review | Martinho Simões | |
ΔfH°solid | -661. ± 21. | kJ/mol | Review | Martinho Simões | |
Quantity | Value | Units | Method | Reference | Comment |
ΔcH°solid | -5715. ± 21. | kJ/mol | CC-SB | Dillard and Kiser, 1969 | The combustion conditions and reaction are ill-defined in Dillard and Kiser, 1969. The composition of the hydrochloric acid solution, HCl,74H2O, was assigned on the basis of the auxiliary data used by authors and their literature references. |
ΔcH°solid | -5849. ± 21. | kJ/mol | CC-SB | Dillard and Kiser, 1969 | The combustion conditions and reaction are ill-defined in Dillard and Kiser, 1969. The composition of the hydrochloric acid solution, HCl,74H2O, was assigned on the basis of the auxiliary data used by authors and their literature references. |
ΔcH°solid | -5971.4 ± 7.5 | kJ/mol | CC-SB | Tel' noi, Rabinovich, et al., 1967 | Please also see Pedley and Rylance, 1977 and Tel'noi and Rabinovich, 1977. The enthalpy of combustion was quoted from Tel'noi and Rabinovich, 1977. |

Gas phase ion energetics data

Data compiled as indicated in comments:
LBLHLM - Sharon G. Lias, John E. Bartmess, Joel F. Liebman, John L. Holmes, Rhoda D. Levin, and W. Gary Mallard
LLK - Sharon G. Lias, Rhoda D. Levin, and Sherif A. Kafafi
RDSH - Henry M. Rosenstock, Keith Draxl, Bruce W. Steiner, and John T. Herron
Ionization energy determinations
IE (eV) | Method | Reference | Comment |
---|---|---|---|
8.98 ± 0.16 | EI | Dillard and Kiser, 1969 | RDSH |
8.50 | PE | Bohm, 1982 | Vertical value; LBLHLM |
8.5 ± 0.1 | PE | Cauletti, Clark, et al., 1980 | Vertical value; LLK |
8.46 ± 0.05 | PE | Condorelli, Fragala, et al., 1975 | Vertical value; LLK |
Appearance energy determinations
Ion | AE (eV) | Other Products | Method | Reference | Comment |
---|---|---|---|---|---|
C3H3+ | 18.0 ± 0.5 | ? | EI | Dillard and Kiser, 1969 | RDSH |
C3H3ClTi+ | ~19.5 | ? | EI | Dillard and Kiser, 1969 | RDSH |
C5H5+ | 13.0 ± 0.4 | ? | EI | Dillard and Kiser, 1969 | RDSH |
C5H5ClTi+ | 16.3 ± 0.3 | ? | EI | Dillard and Kiser, 1969 | RDSH |
C5H5Cl2Ti+ | 11.8 ± 0.2 | ? | EI | Dillard and Kiser, 1969 | RDSH |
C10H10ClTi+ | 10.8 ± 0.3 | Cl | EI | Dillard and Kiser, 1969 | RDSH |
TiCl+ | 21.6 ± 0.4 | ? | EI | Dillard and Kiser, 1969 | RDSH |
TiCl2+ | 19.7 ± 0.4 | ? | EI | Dillard and Kiser, 1969 | RDSH |

Phase change data

Data compiled as indicated in comments:
AC - William E. Acree, Jr., James S. Chickos
MS - José A. Martinho Simões
Quantity | Value | Units | Method | Reference | Comment |
---|---|---|---|---|---|
ΔsubH° | 26. ± 5. | kcal/mol | AVG | N/A | Average of 6 values; Individual data points |
Enthalpy of sublimation
ΔsubH (kcal/mol) | Temperature (K) | Method | Reference | Comment |
---|---|---|---|---|
29.73 | 475.5 | A | Stephenson and Malanowski, 1987 | Based on data from 418. to 533. K.; AC |

Reaction thermochemistry data

Data compiled by: José A. Martinho Simões
Individual Reactions
C10H10I2Ti (solution) + (solution) = 2C10H10ClITi (solution)
By formula: C10H10I2Ti (solution) + C10H10Cl2Ti (solution) = 2C10H10ClITi (solution)
Quantity | Value | Units | Method | Reference | Comment |
---|---|---|---|---|---|
ΔrH° | -0.81 | kcal/mol | EqS | Bruce and Tyler, 1985 | solvent: Perdeuterated benzene; The reaction enthalpy relies on a single value for the equilibrium constant. It assumes a negligible reaction entropy |
C30H28Fe2Ti (cr) + 2( • 4.40
) (solution) = 2
(cr) +
(cr)
By formula: C30H28Fe2Ti (cr) + 2(HCl • 4.40H2O) (solution) = 2C10H10Fe (cr) + C10H10Cl2Ti (cr)
Quantity | Value | Units | Method | Reference | Comment |
---|---|---|---|---|---|
ΔrH° | -60.6 ± 1.1 | kcal/mol | RSC | Dias, Salema, et al., 1982 | Please also see Calhorda, Dias, et al., 1987. |
C22H20O2Ti (cr) + 2( • 5.55
) (solution) = 2
(cr) +
(cr)
By formula: C22H20O2Ti (cr) + 2(HCl • 5.55H2O) (solution) = 2C6H6O (cr) + C10H10Cl2Ti (cr)
Quantity | Value | Units | Method | Reference | Comment |
---|---|---|---|---|---|
ΔrH° | -1.4 ± 0.60 | kcal/mol | RSC | Dias, Salema, et al., 1981 | Please also see Calhorda, Carrondo, et al., 1986. |
C14H10Cl6O4Ti (cr) + 2( • 4.40
) (solution) =
(cr) + 2
(cr)
By formula: C14H10Cl6O4Ti (cr) + 2(HCl • 4.40H2O) (solution) = C10H10Cl2Ti (cr) + 2C2HCl3O2 (cr)
Quantity | Value | Units | Method | Reference | Comment |
---|---|---|---|---|---|
ΔrH° | 3.20 ± 0.62 | kcal/mol | RSC | Dias, Salema, et al., 1984 | Please also see Calhorda, Carrondo, et al., 1986. |
C10H10N6Ti (cr) + 2( • 4.18
) (solution) =
(cr) + 2
(g)
By formula: C10H10N6Ti (cr) + 2(HCl • 4.18H2O) (solution) = C10H10Cl2Ti (cr) + 2HN3 (g)
Quantity | Value | Units | Method | Reference | Comment |
---|---|---|---|---|---|
ΔrH° | 18.1 ± 1.4 | kcal/mol | RSC | Calhorda, Gomes da Costa, et al., 1982 | Please also see Dias, Dias, et al., 1987. |
C14H10F6O4Ti (cr) + 2( • 4.40
) (solution) =
(cr) + 2
(l)
By formula: C14H10F6O4Ti (cr) + 2(HCl • 4.40H2O) (solution) = C10H10Cl2Ti (cr) + 2C2HF3O2 (l)
Quantity | Value | Units | Method | Reference | Comment |
---|---|---|---|---|---|
ΔrH° | 9.03 ± 0.55 | kcal/mol | RSC | Calado, Dias, et al., 1981 | Please also see Calhorda, Carrondo, et al., 1986. |
(cr) + 2(
• 5.55
) (solution) =
(cr) + 2
(g)
By formula: C12H16Ti (cr) + 2(HCl • 5.55H2O) (solution) = C10H10Cl2Ti (cr) + 2CH4 (g)
Quantity | Value | Units | Method | Reference | Comment |
---|---|---|---|---|---|
ΔrH° | -45.9 ± 1.4 | kcal/mol | RSC | Calhorda, Dias, et al., 1987 |
C11H13ClTi (cr) + ( • 4.40
) (solution) =
(cr) +
(g)
By formula: C11H13ClTi (cr) + (HCl • 4.40H2O) (solution) = C10H10Cl2Ti (cr) + CH4 (g)
Quantity | Value | Units | Method | Reference | Comment |
---|---|---|---|---|---|
ΔrH° | -16.5 ± 0.74 | kcal/mol | RSC | Calhorda, Dias, et al., 1987 |

References

Martinho Simões
Martinho Simões, J.A.,
Private communication (see http://webbook.nist.gov/chemistry/om/). [all data]
Dillard and Kiser, 1969
Dillard, J.G.; Kiser, R.W.,
The formation of gaseous ions from dicyclopentadienyltitanium dichloride and dicyclopentadienylzirconium dichloride upon electron impact,
J. Organometal. Chem., 1969, 16, 265. [all data]
Tel' noi, Rabinovich, et al., 1967
Tel' noi, V.I.; Rabinovich, I.B.; Tikhonov, V.D.; Latyaeva, V.N.; Vyshmskaya, L.I.; Razuvaev, G.A.,
Dokl. Akad. Nauk SSSR, 1967, 174, 1374. [all data]
Pedley and Rylance, 1977
Pedley, J.B.; Rylance, J.,
Computer Analysed Thermochemical Data: Organic and Organometallic Compounds, University of Sussex, Brigton, 1977. [all data]
Tel'noi and Rabinovich, 1977
Tel'noi, V.I.; Rabinovich, I.B.,
Russ. Chem. Rev., 1977, 46, 689. [all data]
Bohm, 1982
Bohm, M.C.,
The photoelectron spectra of bis(cyclopentadienyl)titanium derivatives - a green's function approach,
Inorg. Chim. Acta, 1982, 62, 171. [all data]
Cauletti, Clark, et al., 1980
Cauletti, C.; Clark, J.P.; Green, J.C.; Jackson, S.E.; Fragala, I.L.; Ciliberto, E.; Coleman, A.W.,
Photoelectron spectra of bis-cyclopentadienyl metal dihalides,
J. Electron Spectrosc. Relat. Phenom., 1980, 18, 61. [all data]
Condorelli, Fragala, et al., 1975
Condorelli, G.; Fragala, I.; Centineo, A.; Tondello, E.,
The electronic structure and photoelectron spectra of dichlorodi-π-cyclopentadienyl- titanium(IV), -zirconium(IV) and- hafnium(IV),
J. Organomet. Chem., 1975, 87, 311. [all data]