Platinum, (η5-2,4-cyclopentadien-1-yl)trimethyl-
- Formula: C8H14Pt
- Molecular weight: 305.281
- CAS Registry Number: 1271-07-4

Phase change data

Data compiled as indicated in comments:
AC - William E. Acree, Jr., James S. Chickos
MS - José A. Martinho Simões
Quantity | Value | Units | Method | Reference | Comment |
---|---|---|---|---|---|
ΔsubH° | 77.8 ± 2.0 | kJ/mol | N/A | Pilcher and Skinner, 1983 | See also Tel'noi and Rabinovich, 1977.; AC |
ΔsubH° | 77.8 ± 2.1 | kJ/mol | CC-SB | Tel'noi and Rabinovich, 1977, 2 | MS |

Gas phase ion energetics data

Data compiled by: Sharon G. Lias and Joel F. Liebman
Ionization energy determinations
IE (eV) | Method | Reference | Comment |
---|---|---|---|
7.90 | PE | Yang, Bancroft, et al., 1990 | Vertical value |

Gas phase thermochemistry data

Data compiled by: José A. Martinho Simões
Quantity | Value | Units | Method | Reference | Comment |
---|---|---|---|---|---|
ΔfH°gas | 58.77 ± 0.76 | kcal/mol | Review | Martinho Simões |

Condensed phase thermochemistry data

Data compiled by: José A. Martinho Simões
Quantity | Value | Units | Method | Reference | Comment |
---|---|---|---|---|---|
ΔfH°solid | 40.18 ± 0.57 | kcal/mol | Review | Martinho Simões | |
Quantity | Value | Units | Method | Reference | Comment |
ΔcH°solid | -1270.8 ± 0.50 | kcal/mol | CC-SB | Tel'noi and Rabinovich, 1977 | Please also see Kharchevnikov and Rabinovich, 1972. |

References

Pilcher and Skinner, 1983
Pilcher, G.; Skinner, H.A.,
Thermochemistry of organometallic compounds, 1983, 43-90, https://doi.org/10.1002/9780470771686.ch2
. [all data]
Tel'noi and Rabinovich, 1977
Tel'noi, V.I.; Rabinovich, I.B.,
Thermochemistry of organic compounds of transition metals,
Usp. Khim., 1977, 46, 8, 1337. [all data]
Tel'noi and Rabinovich, 1977, 2
Tel'noi, V.I.; Rabinovich, I.B.,
Russ. Chem. Rev., 1977, 46, 689. [all data]
Yang, Bancroft, et al., 1990
Yang, D.S.; Bancroft, G.M.; Puddephatt, R.J.; Tan, K.H.; Cutler, J.N.; Bozek, J.D.,
Assignment of the valence molecular orbitals of CpPtMe3 and Me2Pt(COD) using variable-energy photoelectron spectra,
Inorg. Chem., 1990, 29, 4956. [all data]