Titanium, trichlorocyclopentadienyl-
- Formula: C5H5Cl3Ti
- Molecular weight: 219.319
- IUPAC Standard InChIKey: AENCLWKVWIIOQH-UHFFFAOYSA-K
- CAS Registry Number: 1270-98-0
- Chemical structure:

Gas phase thermochemistry data

Data compiled by: José A. Martinho Simões
Quantity | Value | Units | Method | Reference | Comment |
---|---|---|---|---|---|
ΔfH°gas | -520.8 ± 6.8 | kJ/mol | Review | Martinho Simões |

Condensed phase thermochemistry data

Data compiled by: José A. Martinho Simões
Quantity | Value | Units | Method | Reference | Comment |
---|---|---|---|---|---|
ΔfH°solid | -609.9 ± 6.8 | kJ/mol | Review | Martinho Simões | |
Quantity | Value | Units | Method | Reference | Comment |
ΔcH°solid | -3087.0 ± 6.7 | kJ/mol | CC-SB | Tel' noi, Rabinovich, et al., 1967 | Please also see Pedley and Rylance, 1977 and Tel'noi and Rabinovich, 1977. The enthalpy of combustion was quoted from Tel'noi and Rabinovich, 1977 |

Phase change data

Data compiled as indicated in comments:
AC - William E. Acree, Jr., James S. Chickos
MS - José A. Martinho Simões
Quantity | Value | Units | Method | Reference | Comment |
---|---|---|---|---|---|
ΔsubH° | 104.6 ± 8.4 | kJ/mol | N/A | Pilcher and Skinner, 1983 | See also Tel'noi and Rabinovich, 1977, 2.; AC |
ΔsubH° | 89.1 ± 0.8 | kJ/mol | CC-SB | Balducci, Bardi, et al., 1977 | MS |
Enthalpy of sublimation
ΔsubH (kJ/mol) | Temperature (K) | Method | Reference | Comment |
---|---|---|---|---|
89.8 | 379. | A | Stephenson and Malanowski, 1987 | Based on data from 354. to 404. K.; AC |

Gas phase ion energetics data

Data compiled as indicated in comments:
LBLHLM - Sharon G. Lias, John E. Bartmess, Joel F. Liebman, John L. Holmes, Rhoda D. Levin, and W. Gary Mallard
Ionization energy determinations
IE (eV) | Method | Reference | Comment |
---|---|---|---|
9.1 | PE | Terpstra, Louwen, et al., 1984 | LBLHLM |
9.79 | PE | Terpstra, Louwen, et al., 1984 | Vertical value; LBLHLM |

References

Martinho Simões
Martinho Simões, J.A.,
Private communication (see http://webbook.nist.gov/chemistry/om/). [all data]
Tel' noi, Rabinovich, et al., 1967
Tel' noi, V.I.; Rabinovich, I.B.; Tikhonov, V.D.; Latyaeva, V.N.; Vyshmskaya, L.I.; Razuvaev, G.A.,
Dokl. Akad. Nauk SSSR, 1967, 174, 1374. [all data]
Pedley and Rylance, 1977
Pedley, J.B.; Rylance, J.,
Computer Analysed Thermochemical Data: Organic and Organometallic Compounds, University of Sussex, Brigton, 1977. [all data]
Tel'noi and Rabinovich, 1977
Tel'noi, V.I.; Rabinovich, I.B.,
Russ. Chem. Rev., 1977, 46, 689. [all data]
Pilcher and Skinner, 1983
Pilcher, G.; Skinner, H.A.,
Thermochemistry of organometallic compounds, 1983, 43-90, https://doi.org/10.1002/9780470771686.ch2
. [all data]
Tel'noi and Rabinovich, 1977, 2
Tel'noi, V.I.; Rabinovich, I.B.,
Thermochemistry of organic compounds of transition metals,
Usp. Khim., 1977, 46, 8, 1337. [all data]
Balducci, Bardi, et al., 1977
Balducci, G.; Bardi, G.; de Maria, G.; Gigli, R.,
VII All-Union Calorimetry Conference, Moscow, 1977. [all data]
Stephenson and Malanowski, 1987
Stephenson, Richard M.; Malanowski, Stanislaw,
Handbook of the Thermodynamics of Organic Compounds, 1987, https://doi.org/10.1007/978-94-009-3173-2
. [all data]
Terpstra, Louwen, et al., 1984
Terpstra, A.; Louwen, J.N.; Oskam, A.; Teuben, J.H.,
The He(I) and He(II) photoelectron spectra of some η5-cyclopentadienyl-titanium,-zirconium and -hafnium trihalide complexes,
J. Organomet. Chem., 1984, 260, 207. [all data]