Thorocene
- Formula: C16H16Th
- Molecular weight: 440.3363
- CAS Registry Number: 12702-09-9

Gas phase thermochemistry data

Data compiled by: José A. Martinho Simões
Quantity | Value | Units | Method | Reference | Comment |
---|---|---|---|---|---|
ΔfH°gas | 48.6 ± 4.3 | kcal/mol | Review | Martinho Simões |

Condensed phase thermochemistry data

Data compiled by: José A. Martinho Simões
Quantity | Value | Units | Method | Reference | Comment |
---|---|---|---|---|---|
ΔfH°solid | 21.2 ± 4.2 | kcal/mol | Review | Martinho Simões | |
Quantity | Value | Units | Method | Reference | Comment |
ΔcH°solid | -2366. ± 4.1 | kcal/mol | CC-SB | Kuznetsov, Kir'yanov, et al., 1986 |

Gas phase ion energetics data

Data compiled by: Sharon G. Lias, Rhoda D. Levin, and Sherif A. Kafafi
Ionization energy determinations
IE (eV) | Method | Reference | Comment |
---|---|---|---|
6.75 | PE | Fragala, Condorelli, et al., 1976 | Vertical value |
6.79 | PE | Clark and Green, 1976 | Vertical value |

Phase change data

Data compiled by: José A. Martinho Simões

Quantity Value Units Method Reference Comment
Δsub27. ± 1.kcal/molCC-SBKuznetsov, Kir'yanov, et al., 1986

References

Martinho Simões
Martinho Simões, J.A.,
Private communication (see http://webbook.nist.gov/chemistry/om/). [all data]
Kuznetsov, Kir'yanov, et al., 1986
Kuznetsov, N.T.; Kir'yanov, K.V.; Mitin, V.A.; Sevast'yanov, V.G.; Bogdanov, V.A.,
Radiokhimiya, 1986, 28, 709. [all data]
Fragala, Condorelli, et al., 1976
Fragala, I.; Condorelli, G.; Zanella, P.; Tondello, E.,
Photoelectron spectroscopy of actinide organometallic compounds I. Bis (cyclooctatetraene)actinide(IV) complexes,
J. Organomet. Chem., 1976, 122, 357. [all data]
Clark and Green, 1976
Clark, J.P.; Green, J.C.,
The He-I photoelectron spectra of uranocene and thorocene,
J. Organomet. Chem., 1976, 112, 14. [all data]