1,3-Butadiene, 2-chloro-
- Formula: C4H5Cl
- Molecular weight: 88.535
- IUPAC Standard InChIKey: YACLQRRMGMJLJV-UHFFFAOYSA-N
- CAS Registry Number: 126-99-8
- Chemical structure:
View 3d structure (requires JavaScript / HTML 5) - Other names: Chloroprene; 2-Chloro-1,3-butadiene; 2-Chlorobutadiene; 2-Chlorobuta-1,3-diene; β-Chloroprene; Chlorobutadiene; Chloropreen; Chloropren; Cloroprene; Neoprene; 2-Chloor-1,3-butadieen; 2-Chlor-1,3-butadien; 2-Cloro-1,3-butadiene; UN 1991; β-Chlorobutadiene; 2-Chlorobutadiene 1,3; 2-Chloroprene; NSC 18589

Phase change data

Data compiled as indicated in comments:
BS - Robert L. Brown and Stephen E. Stein
AC - William E. Acree, Jr., James S. Chickos
Quantity | Value | Units | Method | Reference | Comment |
---|---|---|---|---|---|
Tboil | 332.6 | K | N/A | Weast and Grasselli, 1989 | BS |
Enthalpy of vaporization
ΔvapH (kJ/mol) | Temperature (K) | Method | Reference | Comment |
---|---|---|---|---|
29.6 | 253. | A | Stephenson and Malanowski, 1987 | Based on data from 243. to 263. K.; AC |
29.6 | 294. | A | Stephenson and Malanowski, 1987 | Based on data from 279. to 333. K. See also Dykyj, 1971.; AC |
30.9 | 308. | N/A | Gubkov, Fermor, et al., 1964 | Based on data from 293. to 333. K. See also Boublik, Fried, et al., 1984.; AC |
Antoine Equation Parameters
log10(P) = A − (B / (T + C))
P = vapor pressure (bar)
T = temperature (K)
View plot Requires a JavaScript / HTML 5 canvas capable browser.
Temperature (K) | A | B | C | Reference | Comment |
---|---|---|---|---|---|
293. to 333. | 3.41541 | 841.921 | -85.364 | Gubkov, Fermor, et al., 1964, 2 | Coefficents calculated by NIST from author's data. |

Gas phase ion energetics data

Data compiled by: Henry M. Rosenstock, Keith Draxl, Bruce W. Steiner, and John T. Herron
Ionization energy determinations
IE (eV) | Method | Reference |
---|---|---|
8.83 ± 0.01 | S | Price and Walsh, 1940 |

Normal alkane RI, non-polar column, temperature ramp

Column type | Active phase | I | Reference | Comment |
---|---|---|---|---|
Capillary | Ultra-ALLOY-5 | 550. | Tsuge, Ohtan, et al., 2011 | 30. m/0.25 mm/0.25 μm, 40. C @ 2. min, 20. K/min, 320. C @ 13. min |
Capillary | OV-101 | 572. | Zenkevich, 2005 | 25. m/0.20 mm/0.10 μm, N2/He, 6. K/min; Tstart: 50. C; Tend: 250. C |
Capillary | SE-54 | 557. | Huang, Liang, et al., 1996 | 36. m/0.25 mm/0.25 μm, 5. K/min; Tstart: 35. C; Tend: 240. C |

Normal alkane RI, non-polar column, custom temperature program

Column type | Active phase | I | Reference | Comment |
---|---|---|---|---|
Capillary | Polydimethyl siloxanes | 572. | Zenkevich and Chupalov, 1996 | Program: not specified |

References

Weast and Grasselli, 1989
CRC Handbook of Data on Organic Compounds, 2nd Editon, Weast,R.C and Grasselli, J.G., ed(s)., CRC Press, Inc., Boca Raton, FL, 1989, 1. [all data]
Stephenson and Malanowski, 1987
Stephenson, Richard M.; Malanowski, Stanislaw,
Handbook of the Thermodynamics of Organic Compounds, 1987, https://doi.org/10.1007/978-94-009-3173-2
. [all data]
Dykyj, 1971
Dykyj, J.,
Petrochemia, 1971, 11, 2, 27. [all data]
Gubkov, Fermor, et al., 1964
Gubkov, A.N.; Fermor, N.A.; Smirnov, N.I.,
Zh. Prikl. Khim. (S.-Peterburg), 1964, 37, 2204. [all data]
Boublik, Fried, et al., 1984
Boublik, T.; Fried, V.; Hala, E.,
The Vapour Pressures of Pure Substances: Selected Values of the Temperature Dependence of the Vapour Pressures of Some Pure Substances in the Normal and Low Pressure Region, 2nd ed., Elsevier, New York, 1984, 972. [all data]
Gubkov, Fermor, et al., 1964, 2
Gubkov, A.N.; Fermor, N.A.; Smirnov, N.I.,
Vapor Pressure of Mono-Poly Systems,
Zh. Prikl. Khim. (Leningrad), 1964, 37, 2204-2210. [all data]
Price and Walsh, 1940
Price, W.C.; Walsh, A.D.,
The absorption spectra of conjugated dienes in the vacuum ultra-violet (1),
Proc. Roy. Soc. (London), 1940, A174, 220. [all data]
Fihtengolts, et al., 1969
Fihtengolts, V.S., et al.,
Atlas of UV Absorption Spectra of Substances Used in Synthetic Rubber Manufacture, 1969, 10. [all data]
Tsuge, Ohtan, et al., 2011
Tsuge, S.; Ohtan, H.; Watanabe, C.,
Pyrolysis - GC/MS Data Book of Synthetic Polymers, Elsevier, 2011, 420. [all data]
Zenkevich, 2005
Zenkevich, I.G.,
Experimentally measured retention indices., 2005. [all data]
Huang, Liang, et al., 1996
Huang, C.; Liang, H.; Han, S.,
The analysis of organic compounds in waste water by gas extraction/thermal desorption/gas chromatography-mass spectrometry,
Chin. J. Chromatogr., 1996, 14, 6, 421-424. [all data]
Zenkevich and Chupalov, 1996
Zenkevich, I.G.; Chupalov, A.A.,
New Possibilities of Chromato Mass Pectrometric Identification of Organic Compounds Using Increments of Gas Chromatographic Retention Indices of Molecular Structural Fragments,
Zh. Org. Khim. (Rus.), 1996, 32, 5, 656-666. [all data]