Arsenic monohydride
- Formula: AsH
- Molecular weight: 75.92954
- IUPAC Standard InChIKey: UIESIEAPEWREMY-UHFFFAOYSA-N
- CAS Registry Number: 12628-08-9
- Chemical structure:
View 3d structure (requires JavaScript / HTML 5) - Permanent link for this species. Use this link for bookmarking this species for future reference.

Gas phase ion energetics data

Data compiled as indicated in comments:
B - John E. Bartmess
LL - Sharon G. Lias and Joel F. Liebman
Electron affinity determinations
EA (eV) | Method | Reference | Comment |
---|---|---|---|
1.00 ± 0.10 | PD | Rackwitz, Feldman, et al., 1977 | B |
<1.09997 | IMRB | Ebinghaus, Kraus, et al., 1964 | From AsH3; B |
Ionization energy determinations
IE (eV) | Method | Reference | Comment |
---|---|---|---|
9.641 ± 0.008 | PI | Berkowitz, 1988 | LL |
De-protonation reactions
As- + =
Quantity | Value | Units | Method | Reference | Comment |
---|---|---|---|---|---|
ΔrH° | 1508.1 ± 2.9 | kJ/mol | D-EA | Walter, Gibson, et al., 2009 | gas phase; B |

Reaction thermochemistry data

Data compiled by: John E. Bartmess
Individual Reactions
(CAS Reg. No. 13937-35-4 • 4294967295) +
= CAS Reg. No. 13937-35-4
By formula: (CAS Reg. No. 13937-35-4 • 4294967295HAs) + HAs = CAS Reg. No. 13937-35-4
Quantity | Value | Units | Method | Reference | Comment |
---|---|---|---|---|---|
ΔrH° | 86.8 ± 2.5 | kcal/mol | N/A | Gal, Maria, et al., 1989 | gas phase |
As- + =
Quantity | Value | Units | Method | Reference | Comment |
---|---|---|---|---|---|
ΔrH° | 360.44 ± 0.70 | kcal/mol | D-EA | Walter, Gibson, et al., 2009 | gas phase |

Constants of diatomic molecules

Data compiled by: Klaus P. Huber and Gerhard H. Herzberg

Data collected through February, 1976

Symbols used in the table of constants
SymbolMeaning
State electronic state and / or symmetry symbol
Te minimum electronic energy (cm-1)
ωe vibrational constant – first term (cm-1)
ωexe vibrational constant – second term (cm-1)
ωeye vibrational constant – third term (cm-1)
Be rotational constant in equilibrium position (cm-1)
αe rotational constant – first term (cm-1)
γe rotation-vibration interaction constant (cm-1)
De centrifugal distortion constant (cm-1)
βe rotational constant – first term, centrifugal force (cm-1)
re internuclear distance (Å)
Trans. observed transition(s) corresponding to electronic state
ν00 position of 0-0 band (units noted in table)
Diatomic constants for 75AsH
StateTeωeωexeωeyeBeαeγeDeβereTrans.ν00
A 3Πi 0 1 [1207.5] 2 Z   [6.5623] 3 4 0.886 2  [0.000703]  [1.6203] 5 A ← X R 30518.34 Z
Dixon and Lamberton, 1968; Veseth, 1972
A 3Πi 1     [6.4726] 6 4   [0.000624]   A ← X R 29821.97 Z
Dixon and Lamberton, 1968; Veseth, 1972
A 3Πi 2     [6.3387] 4   [0.000554]   A ← X R 29282.16 Z
Dixon and Lamberton, 1968; Veseth, 1972
X 3Σ- 0 7 (2130)   [7.1998] 7   [0.000329]  [1.5344]

References

Rackwitz, Feldman, et al., 1977
Rackwitz, R.; Feldman, D.; Kaiser, H.J.; Heincke, E.,
Photodetachment bei einigen zweiatomigen negativen hydridionen: BeH-, MgH-, CaH-, ZnH-, PH-, AsH-,
Z. Naturforsch. A:, 1977, 32, 594. [all data]
Ebinghaus, Kraus, et al., 1964
Ebinghaus, H.; Kraus, K.; Neuert, H.; Muller-Duysing, W.,
Negative Ionen durch Elecktronenresonanzeinfang in PH3, AsH3, und SiH4,
Z. Naturfor., 1964, 19A, 732. [all data]
Berkowitz, 1988
Berkowitz, J.,
Photoionization mass spectrometric studies of AsHn(n=1-3),
J. Chem. Phys., 1988, 89, 7065. [all data]
Walter, Gibson, et al., 2009
Walter, C.W.; Gibson, N.D.; Field, R.L.; Snedden, A.P.; Shapiro, J.Z.; Janczak, C.M.; Hanstorp, D.,
Electron affinity of arsenic and the fine structure of As- measured using infrared photodetachment threshold spectroscopy,
Phys. Rev. A, 2009, 80, 1, 014501, https://doi.org/10.1103/PhysRevA.80.014501
. [all data]