Rhodium, compound with titanium (1:1)
- Formula: RhTi
- Molecular weight: 150.773
- IUPAC Standard InChIKey: KHZALYIIDCJNTD-UHFFFAOYSA-N
- CAS Registry Number: 12600-90-7
- Chemical structure:
View 3d structure (requires JavaScript / HTML 5) - Permanent link for this species. Use this link for bookmarking this species for future reference.

Gas phase ion energetics data

Data compiled as indicated in comments:
LLK - Sharon G. Lias, Rhoda D. Levin, and Sherif A. Kafafi
Ionization energy determinations
IE (eV) | Method | Reference | Comment |
---|---|---|---|
8.2 ± 1.0 | EI | Cocke and Gingerich, 1974 | LLK |

References

Cocke and Gingerich, 1974
Cocke, D.L.; Gingerich, K.A.,
Thermodynamic investigation of the gaseous molecules TiRh, Rh2, and Ti2Rh by mass spectrometry,
J. Chem. Phys., 1974, 60, 1958. [all data]