Dialuminum telluride

Gas phase ion energetics data

Data compiled by: Henry M. Rosenstock, Keith Draxl, Bruce W. Steiner, and John T. Herron

Ionization energy determinations

IE (eV) Method Reference
10.0 ± 0.5EIFicalora, Hastie, et al., 1968

References

Ficalora, Hastie, et al., 1968
Ficalora, P.J.; Hastie, J.W.; Margrave, J.L., Mass spectrometric studies at high temperatures. XXVII. The reactions of aluminum vapor with S2(g), Se2(g), and Te2(g), J. Phys. Chem., 1968, 72, 1660. [all data]