Niobium dimer

Gas phase ion energetics data

Data compiled by: Sharon G. Lias and Joel F. Liebman

Ionization energy determinations

IE (eV) Method Reference
6.368 ± 0.001LSJames, Kowalczyk, et al., 1994

References

James, Kowalczyk, et al., 1994
James, A.M.; Kowalczyk, P.; Langlois, E.; Campbell, M.D.; Ogawa, A.; Simard, B., Resonant two photon ionization spectroscopy of the molecules V2, VNb, and Nb2, J. Chem. Phys., 1994, 101, 4485. [all data]