Tungsten,hexacarbonylbis(η5-2,4-cyclopentadien-1-yl)di-

Gas phase ion energetics data

Data compiled by: Sharon G. Lias, Rhoda D. Levin, and Sherif A. Kafafi

Ionization energy determinations

IE (eV) Method Reference
6.65 ± 0.05EIKrause and Bidinosti, 1975

Appearance energy determinations

Ion AE (eV) Other Products MethodReferenceComment
C6H6W2+29.0 ± 1.0?EIKrause and Bidinosti, 1975
C8H5O3W+10.1 ± 0.2C5H5(CO)3WEIKrause and Bidinosti, 1975
C8H8W2+25.0 ± 1.0?EIKrause and Bidinosti, 1975
C10H10W2+15.5 ± 0.56COEIKrause and Bidinosti, 1975
C11H10OW2+13.85 ± 0.105COEIKrause and Bidinosti, 1975
C12H10O2W2+12.89 ± 0.104COEIKrause and Bidinosti, 1975
C13H10O3W2+11.00 ± 0.203COEIKrause and Bidinosti, 1975
C14H10O4W2+8.61 ± 0.052COEIKrause and Bidinosti, 1975
C15H10O5W2+7.70 ± 0.05COEIKrause and Bidinosti, 1975

References

Krause and Bidinosti, 1975
Krause, J.R.; Bidinosti, D.R., Mass spectrometric studies of the ionization and thermal decomposition of tungsten π-cyclopentadienyl tricarbonyl dimer, Can. J. Chem., 1975, 53, 628. [all data]