Cyanoethynyl radical
- Formula: C3N
- Molecular weight: 50.0388
- IUPAC Standard InChIKey: URBHYAWCGWIELS-UHFFFAOYSA-N
- CAS Registry Number: 12543-75-8
- Chemical structure:
View 3d structure (requires JavaScript / HTML 5) - Permanent link for this species. Use this link for bookmarking this species for future reference.

Gas phase ion energetics data

Data compiled as indicated in comments:
RDSH - Henry M. Rosenstock, Keith Draxl, Bruce W. Steiner, and John T. Herron
B - John E. Bartmess
Electron affinity determinations
EA (eV) | Method | Reference | Comment |
---|---|---|---|
4.30500 ± 0.00010 | N/A | Yen, Garand, et al., 2010 | B |
4.43 ± 0.15 | D-EA | Taft, Abboud, et al., 1988 | B |
4.59 ± 0.25 | EIAE | Graupner, Merrigan, et al., 2006 | B |
2.39999 | EIAE | Tsuda, Yokohata, et al., 1971 | From EtCN; B |
2.38503 | EIAE | Dibeler, Reese, et al., 1961 | From HC≡C-C≡N; B |
Ionization energy determinations
IE (eV) | Method | Reference | Comment |
---|---|---|---|
~14.4 | EI | Dibeler, Reese, et al., 1961 | RDSH |

References

Yen, Garand, et al., 2010
Yen, T.A.; Garand, E.; Shreve, A.T.; Neumark, D.M.,
Anion Photoelectron Spectroscopy of C3N- and C5N-,
J. Phys. Chem. A, 2010, 114, 9, 3215-3220, https://doi.org/10.1021/jp9093996
. [all data]
Taft, Abboud, et al., 1988
Taft, R.W.; Abboud, J.L.M.; Anvia, F.; Berthelot, M.; Fujio, M.; Gal, J.-F.; Headley, A.D.; Henderson, W.G.,
Regarding the Inherent Dependence of Resonance Effects of Strongly Conjugated Substituents on Electron Demand,
J. Am. Chem. Soc., 1988, 110, 6, 1797, https://doi.org/10.1021/ja00214a023
. [all data]
Graupner, Merrigan, et al., 2006
Graupner, K.; Merrigan, T.L.; Field, T.A.; Youngs, T.G.A.; Marr, P.C.,
Dissociative Electron Attachment to HCCCN,
New J. Phys., 2006, , 117 (2006), 7, 117, https://doi.org/10.1088/1367-2630/8/7/117
. [all data]
Tsuda, Yokohata, et al., 1971
Tsuda, S.; Yokohata, A.; Umaba, T.,
Measurement of negative ions formed by electron impact. VIII. Ionization efficiency curves of negative ions from methyl and ethyl cyanides,
Bull. Chem. Soc. Jpn., 1971, 44, 1486. [all data]
Dibeler, Reese, et al., 1961
Dibeler, V.H.; Reese, R.M.; Franklin, J.L.,
Mass spectrometric study of cyanogen and cyanoacetylenes,
J. Am. Chem. Soc., 1961, 83, 1813. [all data]