Carbon disulfide cation
- Formula: CS2
- Molecular weight: 76.141
- IUPAC Standard InChIKey: PGXKVSYXGLLKDQ-UHFFFAOYSA-N
- CAS Registry Number: 12539-80-9
- Chemical structure:
View 3d structure (requires JavaScript / HTML 5) - Permanent link for this species. Use this link for bookmarking this species for future reference.

Gas phase ion energetics data

Data compiled by: Henry M. Rosenstock, Keith Draxl, Bruce W. Steiner, and John T. Herron
Appearance energy determinations
Ion | AE (eV) | Other Products | Method | Reference | Comment |
---|---|---|---|---|---|
C+ | 12.3 ± 0.9 | 2S | EI | Cuthbert, Farren, et al., 1968 |

References

Cuthbert, Farren, et al., 1968
Cuthbert, J.; Farren, J.; PrahalladaRao, B.S.; Preece, E.R.,
Sequential mass spectrometry. III. Ions and fragments from carbon dioxide anddisulphide,
J. Phys. B:, 1968, 1, 62. [all data]