Boron monoxide
- Formula: BO
- Molecular weight: 26.810
- IUPAC Standard InChIKey: MOWNZPNSYMGTMD-UHFFFAOYSA-N
- CAS Registry Number: 12505-77-0
- Chemical structure:
View 3d structure (requires JavaScript / HTML 5) - Permanent link for this species. Use this link for bookmarking this species for future reference.

Gas phase thermochemistry data

Quantity | Value | Units | Method | Reference | Comment |
---|---|---|---|---|---|
S°gas,1 bar | 203.48 | J/mol*K | Review | Chase, 1998 | Data last reviewed in June, 1968 |
Gas Phase Heat Capacity (Shomate Equation)
Cp° = A + B*t + C*t2 + D*t3 +
E/t2
H° − H°298.15= A*t + B*t2/2 +
C*t3/3 + D*t4/4 − E/t + F − H
S° = A*ln(t) + B*t + C*t2/2 + D*t3/3 −
E/(2*t2) + G
Cp = heat capacity (J/mol*K)
H° = standard enthalpy (kJ/mol)
S° = standard entropy (J/mol*K)
t = temperature (K) / 1000.
View plot Requires a JavaScript / HTML 5 canvas capable browser.
Temperature (K) | 298. to 1200. | 1200. to 6000. |
---|---|---|
A | 23.60772 | 36.40762 |
B | 13.23776 | 0.800475 |
C | -1.775887 | -0.199127 |
D | -1.293292 | 0.029077 |
E | 0.164045 | -3.366318 |
F | -7.057488 | -18.00153 |
G | 229.1108 | 238.5763 |
H | 0.000000 | 0.000000 |
Reference | Chase, 1998 | Chase, 1998 |
Comment | Data last reviewed in June, 1968 | Data last reviewed in June, 1968 |

Gas phase ion energetics data

Data compiled as indicated in comments:
LL - Sharon G. Lias and Joel F. Liebman
LLK - Sharon G. Lias, Rhoda D. Levin, and Sherif A. Kafafi
RDSH - Henry M. Rosenstock, Keith Draxl, Bruce W. Steiner, and John T. Herron
Ionization energy determinations
IE (eV) | Method | Reference | Comment |
---|---|---|---|
13.3 ± 0.5 | EI | Asano and Kou, 1988 | LL |
13.5 ± 0.3 | EI | Bagarat'yan and Nikitin, 1979 | LLK |
13.2 ± 0.2 | EI | Murad and Hildenbrand, 1975 | LLK |
13.0 ± 0.5 | EI | Gingerich and Pupp, 1971 | LLK |
13. ± 1. | EI | Uy and Drowart, 1970 | RDSH |
13.5 ± 0.5 | EI | Blackburn, Buchler, et al., 1966 | RDSH |

Constants of diatomic molecules

Data compiled by: Klaus P. Huber and Gerhard H. Herzberg
Data collected through June, 1976
Symbol | Meaning |
---|---|
State | electronic state and / or symmetry symbol |
Te | minimum electronic energy (cm-1) |
ωe | vibrational constant – first term (cm-1) |
ωexe | vibrational constant – second term (cm-1) |
ωeye | vibrational constant – third term (cm-1) |
Be | rotational constant in equilibrium position (cm-1) |
αe | rotational constant – first term (cm-1) |
γe | rotation-vibration interaction constant (cm-1) |
De | centrifugal distortion constant (cm-1) |
βe | rotational constant – first term, centrifugal force (cm-1) |
re | internuclear distance (Å) |
Trans. | observed transition(s) corresponding to electronic state |
ν00 | position of 0-0 band (units noted in table) |
State | Te | ωe | ωexe | ωeye | Be | αe | γe | De | βe | re | Trans. | ν00 |
---|---|---|---|---|---|---|---|---|---|---|---|---|
C 2Π(r) | 55346.1 1 | 1315.3 H | 11.1 | 1.483 | 0.018 | 0.000008 | 1.320 | C → X R | 55O61.5 2 | |||
↳missing citation; Kuzyakov, Tetevskiy, et al., 1960; missing citation | ||||||||||||
B 2Σ+ | 43174.05 | 1281.69 Z | 10.66 | 1.5171 3 4 | 0.0210 | 0.0000085 | 1.3054 | B → A 5 V | 19225.9 | |||
↳Mulliken, 1925 | ||||||||||||
B → A 5 V | 19351.0 | |||||||||||
↳Mulliken, 1925 | ||||||||||||
B → X 6 R | 42872.34 Z | |||||||||||
↳missing citation; missing citation; Funke and Simons, 1935; missing citation | ||||||||||||
State | Te | ωe | ωexe | ωeye | Be | αe | γe | De | βe | re | Trans. | ν00 |
A 2Πi | 23958.76 7 | 1260.70 Z | 11.157 8 | 0.049 | [1.4018] 94 | 0.0196 | [0.00000763] | 1.3533 | A ↔ X 10 R | 23646.43 8 Z | ||
↳missing citation; missing citation; missing citation; missing citation; Thrush, 1960; Dunn and Hanson, 1969 | ||||||||||||
23833.7 | A ↔ X 10 R | 23521.3 8 Z | ||||||||||
↳missing citation; missing citation; missing citation; missing citation; Thrush, 1960; Dunn and Hanson, 1969 | ||||||||||||
X 2Σ+ | 0 | 1885.69 Z | 11.81 | 1.7820 11 4 | 0.0166 | 0.00000632 12 | 0.00000002 | 1.2045 13 |

References

Chase, 1998
Chase, M.W., Jr.,
NIST-JANAF Themochemical Tables, Fourth Edition,
J. Phys. Chem. Ref. Data, Monograph 9, 1998, 1-1951. [all data]
Asano and Kou, 1988
Asano, M.; Kou, T.,
Thermochemical properties of SrBO2(g) and SrB2O4(s),
J. Chem. Thermodyn., 1988, 20, 1149. [all data]
Bagarat'yan and Nikitin, 1979
Bagarat'yan, N.V.; Nikitin, O.T.,
Electron ionization of vapor over boron oxide,
Vestn. Mosk. Univ. Khim., 1979, 34, 539. [all data]
Murad and Hildenbrand, 1975
Murad, E.; Hildenbrand, D.L.,
Thermochemical properties of gaseous ZrO and ZrO2,
J. Chem. Phys., 1975, 63, 1133. [all data]
Gingerich and Pupp, 1971
Gingerich, K.A.; Pupp, C.,
Mass spectrometric determination of the heats of formation atomization of gaseous AuBO,
J. Chem. Phys., 1971, 54, 3713. [all data]
Uy and Drowart, 1970
Uy, O.M.; Drowart, J.,
Mass spectrometric determination of the dissociation energies of the boron monochalcogenides,
High Temp. Sci., 1970, 2, 293. [all data]
Blackburn, Buchler, et al., 1966
Blackburn, P.E.; Buchler, A.; Stauffer, J.L.,
Thermodynamics of vaporization in the aluminum oxideboron oxide system,
J. Phys. Chem., 1966, 70, 2469. [all data]