Methanesulfonyl chloride
- Formula: CH3ClO2S
- Molecular weight: 114.551
- IUPAC Standard InChIKey: QARBMVPHQWIHKH-UHFFFAOYSA-N
- CAS Registry Number: 124-63-0
- Chemical structure:
View 3d structure (requires JavaScript / HTML 5) - Other names: Chloro methyl sulfone; Mesyl chloride; Methanesulfonic acid chloride; Methanesulfuryl chloride; Methanesulphonyl chloride; Methyl sulfochloride; Methylsulfonyl chloride; CH3SO2Cl; NSC 15039

Gas phase ion energetics data

Data compiled by: Sharon G. Lias, Rhoda D. Levin, and Sherif A. Kafafi
Ionization energy determinations
IE (eV) | Method | Reference | Comment |
---|---|---|---|
11.6 | PE | Solouki, Bock, et al., 1975 | Vertical value |
11.6 | PE | Solouki, Bock, et al., 1972 | Vertical value |
11.74 | PE | Mines, Thomas, et al., 1972 | Vertical value |

Van Den Dool and Kratz RI, polar column, temperature ramp

Column type | Active phase | I | Reference | Comment |
---|---|---|---|---|
Capillary | DB-Wax | 1216. | Shimoda, Peralta, et al., 1996 | 60. m/0.25 mm/0.25 μm, He, 3. K/min; Tstart: 50. C; Tend: 230. C |

Normal alkane RI, non-polar column, isothermal

Column type | Active phase | Temperature (C) | I | Reference | Comment |
---|---|---|---|---|---|
Packed | Methyl silicone | 130. | 774. | Seifert, Kalina, et al., 1976 | Nitrogen, Chromaton N AW (0.20-0.25 mm); Column length: 6.1 m |
Packed | Methyl silicone | 150. | 778. | Seifert, Kalina, et al., 1976 | Nitrogen, Chromaton N AW (0.20-0.25 mm); Column length: 6.1 m |

Normal alkane RI, non-polar column, temperature ramp

Column type | Active phase | I | Reference | Comment |
---|---|---|---|---|
Capillary | OV-101 | 742. | Zenkevich, 2005 | 25. m/0.20 mm/0.10 μm, N2/He, 6. K/min; Tstart: 50. C; Tend: 250. C |

References

Solouki, Bock, et al., 1975
Solouki, B.; Bock, H.; Appel, R.,
Photoelektronenspektren und Molekuleigenschaften, XLV Schwefelsaure-Derivate X2SY2: Alkyl-, Vinyl- und Arylsulfone, Alkylsulfoimide und Sulfurylhalogenide,
Chem. Ber., 1975, 108, 897. [all data]
Solouki, Bock, et al., 1972
Solouki, B.; Bock, H.; Appel, R.,
Sequence of orbitals in sulfones and sulfodiimides,
Angew. Chem. Int. Ed. Engl., 1972, 11, 927. [all data]
Mines, Thomas, et al., 1972
Mines, G.W.; Thomas, R.K.; Thompson, H.,
Photoelectron spectra of compounds containing thionyl and sulphuryl groups,
Proc. R. Soc. London A:, 1972, 329, 275. [all data]