H2C=(cyc-CN=CCH3)
- Formula: C4H5N
- Molecular weight: 67.0892
- CAS Registry Number: 124318-31-6

Vibrational and/or electronic energy levels

Data compiled by: Marilyn E. Jacox
State: X
Vib. sym. |
No. | Approximate type of mode |
cm-1 | Med. | Method | References | |
---|---|---|---|---|---|---|---|
1865 | Kr | IR | Banert, Hagedorn, et al., 1994 | ||||
1554 | Kr | IR | Banert, Hagedorn, et al., 1994 | ||||
1228 | Kr | IR | Banert, Hagedorn, et al., 1994 | ||||
696 | Kr | IR | Banert, Hagedorn, et al., 1994 | ||||
Additional references: Jacox, 1998, page 361

References

Banert, Hagedorn, et al., 1994
Banert, K.; Hagedorn, M.; Knozinger, E.; Becker, A.; Wurthwein, E.-U.,
Reactions of unsaturated azides. 11. Direct observation of 2-methylene-2H-azirine,
J. Am. Chem. Soc., 1994, 116, 1, 60, https://doi.org/10.1021/ja00080a007
. [all data]
Jacox, 1998
Jacox, M.E.,
Vibrational and electronic energy levels of polyatomic transient molecules: supplement A,
J. Phys. Chem. Ref. Data, 1998, 27, 2, 115-393, https://doi.org/10.1063/1.556017
. [all data]