1-Nonene
- Formula: C9H18
- Molecular weight: 126.2392
- IUPAC Standard InChIKey: JRZJOMJEPLMPRA-UHFFFAOYSA-N
- CAS Registry Number: 124-11-8
- Chemical structure:
View 3d structure (requires JavaScript / HTML 5) - Other names: n-Non-1-ene; 1-C9H18; NSC 73961; Nonene-(1); Nonylene; Non-1-ene

Condensed phase thermochemistry data

Data compiled by: Eugene S. Domalski and Elizabeth D. Hearing
Quantity | Value | Units | Method | Reference | Comment |
---|---|---|---|---|---|
S°liquid | 392.54 | J/mol*K | N/A | Messerly, Todd, et al., 1990 |
Constant pressure heat capacity of liquid
Cp,liquid (J/mol*K) | Temperature (K) | Reference | Comment |
---|---|---|---|
270.36 | 298.15 | Messerly, Todd, et al., 1990 | T = 10 to 330 K. |

Phase change data

Data compiled as indicated in comments:
BS - Robert L. Brown and Stephen E. Stein
TRC - Thermodynamics Research Center, NIST Boulder Laboratories, Chris Muzny director
AC - William E. Acree, Jr., James S. Chickos
DH - Eugene S. Domalski and Elizabeth D. Hearing
Quantity | Value | Units | Method | Reference | Comment |
---|---|---|---|---|---|
Tboil | 419. ± 4. | K | AVG | N/A | Average of 14 values; Individual data points |
Quantity | Value | Units | Method | Reference | Comment |
Tfus | 190. ± 6. | K | AVG | N/A | Average of 7 values; Individual data points |
Quantity | Value | Units | Method | Reference | Comment |
Ttriple | 191.600 | K | N/A | Messerly, Todd, et al., 1990, 2 | Crystal phase 2 phase; Uncertainty assigned by TRC = 0.003 K; TRC |
Ttriple | 191.910 | K | N/A | Messerly, Todd, et al., 1990, 2 | Crystal phase 1 phase; Uncertainty assigned by TRC = 0.003 K; TRC |
Quantity | Value | Units | Method | Reference | Comment |
Tc | 594.0 ± 1.0 | K | N/A | Tsonopoulos and Ambrose, 1996 | |
Quantity | Value | Units | Method | Reference | Comment |
Vc | 0.526 | l/mol | N/A | Tsonopoulos and Ambrose, 1996 | |
Quantity | Value | Units | Method | Reference | Comment |
ρc | 1.9 | mol/l | N/A | Tsonopoulos and Ambrose, 1996 | |
Quantity | Value | Units | Method | Reference | Comment |
ΔvapH° | 44.7 ± 0.2 | kJ/mol | GS | Verevkin, Wandschneider, et al., 2000 | Based on data from 278. to 318. K.; AC |
ΔvapH° | 45.5 | kJ/mol | N/A | Reid, 1972 | AC |
Enthalpy of vaporization
ΔvapH (kJ/mol) | Temperature (K) | Method | Reference | Comment |
---|---|---|---|---|
42.0 | 354. | A,MM | Stephenson and Malanowski, 1987 | Based on data from 339. to 423. K. See also Forziati, Camin, et al., 1950.; AC |
Antoine Equation Parameters
log10(P) = A − (B / (T + C))
P = vapor pressure (bar)
T = temperature (K)
View plot Requires a JavaScript / HTML 5 canvas capable browser.
Temperature (K) | A | B | C | Reference |
---|---|---|---|---|
339.76 to 421.01 | 4.07879 | 1435.359 | -67.615 | Forziati, Camin, et al., 1950, 2 |
Enthalpy of fusion
ΔfusH (kJ/mol) | Temperature (K) | Reference | Comment |
---|---|---|---|
19.97 | 191.6 | Messerly, Todd, et al., 1990 | AC |
Enthalpy of phase transition
ΔHtrs (kJ/mol) | Temperature (K) | Initial Phase | Final Phase | Reference | Comment |
---|---|---|---|---|---|
19.96979 | 191.604 | crystaline, II | liquid | Messerly, Todd, et al., 1990 | DH |
19.35867 | 191.912 | crystaline, I | liquid | Messerly, Todd, et al., 1990 | DH |
Entropy of phase transition
ΔStrs (J/mol*K) | Temperature (K) | Initial Phase | Final Phase | Reference | Comment |
---|---|---|---|---|---|
104.22 | 191.604 | crystaline, II | liquid | Messerly, Todd, et al., 1990 | DH |
100.87 | 191.912 | crystaline, I | liquid | Messerly, Todd, et al., 1990 | DH |

Henry's Law data

Data compiled by: Rolf Sander
Henry's Law constant (water solution)
kH(T) = k°H exp(d(ln(kH))/d(1/T) ((1/T) - 1/(298.15 K)))
k°H = Henry's law constant for solubility in water at 298.15 K (mol/(kg*bar))
d(ln(kH))/d(1/T) = Temperature dependence constant (K)
k°H (mol/(kg*bar)) | d(ln(kH))/d(1/T) (K) | Method | Reference | Comment |
---|---|---|---|---|
0.0012 | Q | N/A | missing citation give several references for the Henry's law constants but don't assign them to specific species. |

Gas phase ion energetics data

Data compiled by: Sharon G. Lias, Rhoda D. Levin, and Sherif A. Kafafi
Ionization energy determinations
IE (eV) | Method | Reference |
---|---|---|
9.42 ± 0.01 | PI | Rang, Martinson, et al., 1974 |

Reaction thermochemistry data

Data compiled by: Hussein Y. Afeefy, Joel F. Liebman, and Stephen E. Stein
Individual Reactions
By formula: C9H18 + H2 = C9H20
Quantity | Value | Units | Method | Reference | Comment |
---|---|---|---|---|---|
ΔrH° | -29.71 ± 0.24 | kcal/mol | Chyd | Rogers and Skanupong, 1974 | liquid phase; solvent: Hexane |

Van Den Dool and Kratz RI, non-polar column, custom temperature program

Data compiled by: NIST Mass Spectrometry Data Center, William E. Wallace, director

Column type CapillaryCapillary
Active phase CP Sil 8 CBDB-5
Column length (m) 60.30.
Carrier gas HeHe
Substrate
Column diameter (mm) 0.250.25
Phase thickness (μm) 0.25
Program 0C => rapidly => 40C(8min) => 4C/min => 250C(10min)30C => 5K/min=120C => 10C/min => 270C
I 892.889.
ReferenceOruna-Concha, Bakker, et al., 2002Zaikin and Borisov, 2002
Comment MSDC-RI MSDC-RI

Normal alkane RI, non-polar column, isothermal

Data compiled by: NIST Mass Spectrometry Data Center, William E. Wallace, director

Column type Capillary
Active phase Squalane
Column length (m)
Carrier gas
Substrate
Column diameter (mm)
Phase thickness (μm)
Temperature (C) 70.
I 883.
ReferenceSchomburg, 1966
Comment MSDC-RI

References

Messerly, Todd, et al., 1990
Messerly, J.F.; Todd, S.S.; Finke, H.L.; Lee-Bechtold, S.H.; Guthrie, G.B.; Steele, W.V.; Chirico, R.D.,
Heat capacities of pent-1-ene (10K to 320K), cis-hex-2-ene (10K to 330K), non-1-ene (10K to 400K), and hexadec-1-ene (10K to 400K),
J. Chem. Thermodynam., 1990, 22, 1107-1128. [all data]
Messerly, Todd, et al., 1990, 2
Messerly, J.F.; Todd, S.S.; Finke, H.L.; Lee-Bechtold, S.H.; Guthrie, G.B.; Steele, W.V.; Chirico, R.D.,
Heat capacities of pent-1-ene (10 K to 320 K), cis-hex-2-ene (10 K to 330 K), non-1-ene (10 K to 400 K) and hexadec-1-ene (10 K to 400 K),
J. Chem. Thermodyn., 1990, 22, 1107-28. [all data]
Tsonopoulos and Ambrose, 1996
Tsonopoulos, C.; Ambrose, D.,
Vapor-Liquid Critical Properties of Elements and Compounds. 6. Unsaturated Aliphatic Hydrocarbons,
J. Chem. Eng. Data, 1996, 41, 645-656. [all data]
Verevkin, Wandschneider, et al., 2000
Verevkin, Sergey P.; Wandschneider, Dirk; Heintz, Andreas,
Determination of Vaporization Enthalpies of Selected Linear and Branched C 7 , C 8 , C 9 , C 11 , and C 12 Monoolefin Hydrocarbons from Transpiration and Correlation Gas-Chromatography Methods,
J. Chem. Eng. Data, 2000, 45, 4, 618-625, https://doi.org/10.1021/je990297k
. [all data]
Reid, 1972
Reid, Robert C.,
Handbook on vapor pressure and heats of vaporization of hydrocarbons and related compounds, R. C. Wilhort and B. J. Zwolinski, Texas A Research Foundation. College Station, Texas(1971). 329 pages.$10.00,
AIChE J., 1972, 18, 6, 1278-1278, https://doi.org/10.1002/aic.690180637
. [all data]
Stephenson and Malanowski, 1987
Stephenson, Richard M.; Malanowski, Stanislaw,
Handbook of the Thermodynamics of Organic Compounds, 1987, https://doi.org/10.1007/978-94-009-3173-2
. [all data]
Forziati, Camin, et al., 1950
Forziati, A.F.; Camin, D.L.; Rossini, F.D.,
Density, refractive index, boiling point, and vapor pressure of eight monoolefin (1-alkene), six pentadiene, and two cyclomonoolefin hydrocarbons,
J. RES. NATL. BUR. STAN., 1950, 45, 5, 406, https://doi.org/10.6028/jres.045.044
. [all data]
Forziati, Camin, et al., 1950, 2
Forziati, a.F.; Camin, D.L.; Rossini, F.D.,
Density, refractive index, boiling point, and vapor pressure of eight monoolefin (1-alkene), six pentadiene, and two cyclomonoolefin hydrocarbons,
J. Res. NBS, 1950, 45, 406-410. [all data]
Rang, Martinson, et al., 1974
Rang, S.; Martinson, E.; Muurisepp, M.,
Ionization potentials of unsaturated hydrocarbons. 1. n-Alkenes, Eesti NSV Teaduste Akadeemia Toimetised 23,
Eesti. NSV Tead. Akad. Toim., 1974, 352. [all data]