1,6-Hexanediamine
- Formula: C6H16N2
- Molecular weight: 116.2046
- IUPAC Standard InChIKey: NAQMVNRVTILPCV-UHFFFAOYSA-N
- CAS Registry Number: 124-09-4
- Chemical structure:
View 3d structure (requires JavaScript / HTML 5) - Other names: Hexamethylenediamine; HMDA; 1,6-Diamino-n-Hexane; 1,6-Diaminohexane; 1,6-Hexylenediamine; H2N(CH2)6NH2; 1,6-Hexamethylenediamine; NCI-C61405; UN 2280; Hexylenediamine; NSC 9257

Condensed phase thermochemistry data

Data compiled by: Hussein Y. Afeefy, Joel F. Liebman, and Stephen E. Stein
Quantity | Value | Units | Method | Reference | Comment |
---|---|---|---|---|---|
ΔfH°solid | -205. | kJ/mol | Ccb | Kuznetsova, Miroshnichenko, et al., 1976 |

Phase change data

Data compiled as indicated in comments:
BS - Robert L. Brown and Stephen E. Stein
AC - William E. Acree, Jr., James S. Chickos
Quantity | Value | Units | Method | Reference | Comment |
---|---|---|---|---|---|
Tboil | 477.7 | K | N/A | Weast and Grasselli, 1989 | BS |
Enthalpy of vaporization
ΔvapH (kJ/mol) | Temperature (K) | Method | Reference | Comment |
---|---|---|---|---|
49.3 | 363. | A | Stephenson and Malanowski, 1987 | Based on data from 348. to 474. K.; AC |
51.3 | 353. | A | Stephenson and Malanowski, 1987 | Based on data from 338. to 473. K.; AC |
Enthalpy of fusion
ΔfusH (kJ/mol) | Temperature (K) | Method | Reference | Comment |
---|---|---|---|---|
39.38 | 311.6 | DSC | Khimeche and Dahmani, 2006 | AC |
40.21 | 312.3 | DSC | Dall'Acqua, Della Gatta, et al., 2002 | AC |

Gas phase ion energetics data

Data evaluated as indicated in comments:
HL - Edward P. Hunter and Sharon G. Lias
Data compiled as indicated in comments:
MM - Michael M. Meot-Ner (Mautner)
LLK - Sharon G. Lias, Rhoda D. Levin, and Sherif A. Kafafi
Quantity | Value | Units | Method | Reference | Comment |
---|---|---|---|---|---|
Proton affinity (review) | 999.5 | kJ/mol | N/A | Hunter and Lias, 1998 | HL |
Quantity | Value | Units | Method | Reference | Comment |
Gas basicity | 946.2 | kJ/mol | N/A | Hunter and Lias, 1998 | HL |
Proton affinity at 298K
Proton affinity (kJ/mol) | Reference | Comment |
---|---|---|
980.3 | Wang, Chu, et al., 1999 | KM results obtained from CID of complexes with secondary amines at E(cm) = 0 eV, extrapolated from CID at E(cm) = 0.8, 1.5, 2.0 eV; MM |
1008. | Wang, Chu, et al., 1999 | KM results obtained from CID of complexes with secondary amines using Fenselau/Wesdemiotis correction; MM |
Ionization energy determinations
IE (eV) | Method | Reference | Comment |
---|---|---|---|
7.52 | PE | Kobayashi, 1978 | Vertical value; LLK |

References

Kuznetsova, Miroshnichenko, et al., 1976
Kuznetsova, V.P.; Miroshnichenko, E.A.; Zelenetskii, A.N.; Rakova, G.V.; Lebedev, Yu.A.; Enikolopyan, N.S.,
Enthalpies of reactions of epoxides with primary amines,
Dokl. Phys. Chem. (Engl. Transl.), 1976, 226, 147-150, In original 1109. [all data]
Weast and Grasselli, 1989
CRC Handbook of Data on Organic Compounds, 2nd Editon, Weast,R.C and Grasselli, J.G., ed(s)., CRC Press, Inc., Boca Raton, FL, 1989, 1. [all data]
Stephenson and Malanowski, 1987
Stephenson, Richard M.; Malanowski, Stanislaw,
Handbook of the Thermodynamics of Organic Compounds, 1987, https://doi.org/10.1007/978-94-009-3173-2
. [all data]
Khimeche and Dahmani, 2006
Khimeche, Kamel; Dahmani, Abdallah,
Solid-Liquid Equilibria of Naphthalene + Alkanediamine Mixtures,
J. Chem. Eng. Data, 2006, 51, 2, 382-385, https://doi.org/10.1021/je0502851
. [all data]
Dall'Acqua, Della Gatta, et al., 2002
Dall'Acqua, Lorenzo; Della Gatta, Giuseppe; Nowicka, Bozenna; Ferloni, Paolo,
Enthalpies and entropies of fusion of ten alkane-α, ω-diamines H2 N-- (CH 2)n-- NH2 where 3≤n≤12,
The Journal of Chemical Thermodynamics, 2002, 34, 1, 1-12, https://doi.org/10.1006/jcht.2001.0950
. [all data]
Hunter and Lias, 1998
Hunter, E.P.; Lias, S.G.,
Evaluated Gas Phase Basicities and Proton Affinities of Molecules: An Update,
J. Phys. Chem. Ref. Data, 1998, 27, 3, 413-656, https://doi.org/10.1063/1.556018
. [all data]
Wang, Chu, et al., 1999
Wang, Z.; Chu, I.K.; Rodriquez, C.F.; Hopkinson, A.C.; Siu, K.W.M.,
α,ω-Diaminoalkanes as models for bases that dicoordinate the proton: An evaluation of the kinetic method for estimating their proton affinities,
J. Phys. Chem. A., 1999, 103, 8700. [all data]
Kobayashi, 1978
Kobayashi, T.,
A new rule for photoelectron angular distributions of molecules,
Phys. Lett. A, 1978, 69, 31. [all data]