2-Propen-1-amine, N-2-propenyl-
- Formula: C6H11N
- Molecular weight: 97.1582
- IUPAC Standard InChIKey: DYUWTXWIYMHBQS-UHFFFAOYSA-N
- CAS Registry Number: 124-02-7
- Chemical structure:
View 3d structure (requires JavaScript / HTML 5) - Other names: Diallylamine; Di-2-propenylamine; (CH2=CHCH2)2NH; UN 2359; N,N-Di(2-propenyl)amine

Phase change data

Data compiled by: Robert L. Brown and Stephen E. Stein
Quantity | Value | Units | Method | Reference | Comment |
---|---|---|---|---|---|
Tboil | 384.2 | K | N/A | Weast and Grasselli, 1989 |

Gas phase ion energetics data

Data evaluated as indicated in comments:
HL - Edward P. Hunter and Sharon G. Lias
Data compiled as indicated in comments:
LLK - Sharon G. Lias, Rhoda D. Levin, and Sherif A. Kafafi
Quantity | Value | Units | Method | Reference | Comment |
---|---|---|---|---|---|
Proton affinity (review) | 949.3 | kJ/mol | N/A | Hunter and Lias, 1998 | HL |
Quantity | Value | Units | Method | Reference | Comment |
Gas basicity | 916.3 | kJ/mol | N/A | Hunter and Lias, 1998 | HL |
Ionization energy determinations
IE (eV) | Method | Reference | Comment |
---|---|---|---|
8.2 | PE | Peel and Willett, 1977 | LLK |
8.8 ± 0.3 | PE | Peel and Willett, 1977 | Vertical value; LLK |
8.79 | PE | Peel and Willett, 1976 | Vertical value; LLK |

Kovats' RI, non-polar column, isothermal

Column type | Active phase | Temperature (C) | I | Reference | Comment |
---|---|---|---|---|---|
Packed | OV-101 | 130. | 660. | Osmialowski, Halkiewicz, et al., 1985 | Ar, Chromosorb W HP; Column length: 1. m |

Normal alkane RI, non-polar column, isothermal

Column type | Active phase | Temperature (C) | I | Reference | Comment |
---|---|---|---|---|---|
Capillary | OV-101 | 130. | 660. | Qi, Yang, et al., 2000 |

Normal alkane RI, non-polar column, custom temperature program

Column type | Active phase | I | Reference | Comment |
---|---|---|---|---|
Capillary | OV-1, SE-30, Methyl silicone, SP-2100, OV-101, DB-1, etc. | 660. | Waggott and Davies, 1984 | Hydrogen; Column length: 50. m; Column diameter: 0.32 mm; Program: not specified |

References

Weast and Grasselli, 1989
CRC Handbook of Data on Organic Compounds, 2nd Editon, Weast,R.C and Grasselli, J.G., ed(s)., CRC Press, Inc., Boca Raton, FL, 1989, 1. [all data]
Hunter and Lias, 1998
Hunter, E.P.; Lias, S.G.,
Evaluated Gas Phase Basicities and Proton Affinities of Molecules: An Update,
J. Phys. Chem. Ref. Data, 1998, 27, 3, 413-656, https://doi.org/10.1063/1.556018
. [all data]
Peel and Willett, 1977
Peel, J.B.; Willett, G.D.,
Photoelectron spectroscopic studies of the propyl- and allyl- substituted amines,
Aust. J. Chem., 1977, 30, 2571. [all data]
Peel and Willett, 1976
Peel, J.B.; Willett, G.D.,
Photoelectron spectra of the allyl amines,
Chem. Phys. Lett., 1976, 38, 479. [all data]
Osmialowski, Halkiewicz, et al., 1985
Osmialowski, K.; Halkiewicz, J.; Radecki, A.; Kaliszan, R.,
Quantum chemical parameters in correlation analysis of gas-liquid chromatographic retention indices of amines,
J. Chromatogr., 1985, 346, 53-60, https://doi.org/10.1016/S0021-9673(00)90493-X
. [all data]
Qi, Yang, et al., 2000
Qi, Y.; Yang, J.; Xu, L.,
correlation analysis of the structures and gas liquid chromatographic retention indices of amines,
Chin. J. Anal. Chem., 2000, 28, 2, 223-227. [all data]
Waggott and Davies, 1984
Waggott, A.; Davies, I.W.,
Identification of organic pollutants using linear temperature programmed retention indices (LTPRIs) - Part II, 1984, retrieved from http://dwi.defra.gov.uk/research/completed-research/reports/dwi0383.pdf. [all data]