Digallium monotelluride
- Formula: Ga2Te
- Molecular weight: 267.05
- IUPAC Standard InChIKey: FDZBCUXYUXYUJI-UHFFFAOYSA-N
- CAS Registry Number: 12401-03-5
- Chemical structure:
View 3d structure (requires JavaScript / HTML 5) - Permanent link for this species. Use this link for bookmarking this species for future reference.

Gas phase ion energetics data

Data compiled by: Henry M. Rosenstock, Keith Draxl, Bruce W. Steiner, and John T. Herron
Ionization energy determinations
IE (eV) | Method | Reference |
---|---|---|
7.6 ± 0.3 | EI | Uy, Muenow, et al., 1968 |
Appearance energy determinations
Ion | AE (eV) | Other Products | Method | Reference | Comment |
---|---|---|---|---|---|
Ga+ | 8.2 ± 0.5 | ? | EI | Uy, Muenow, et al., 1968 | |
Ga2+ | 9.8 ± 0.5 | Te | EI | Uy, Muenow, et al., 1968 |

References

Uy, Muenow, et al., 1968
Uy, O.M.; Muenow, D.W.; Ficalora, P.J.; Margrave, J.L.,
Mass spectrometric studies at high temperatures. Part 30. Vaporization of Ga2S3, Ga2Se3 and Ga2Te3, and stabilities of the gaseous gallium chalcogenides,
J. Chem. Soc. Faraday Trans., 1968, 64, 2998. [all data]