Potassium hydroxide
- Formula: H2K2O2
- Molecular weight: 112.2113
- CAS Registry Number: 12395-66-3

Gas phase thermochemistry data

Quantity | Value | Units | Method | Reference | Comment |
---|---|---|---|---|---|
ΔfH°gas | -654.80 | kJ/mol | Review | Chase, 1998 | Data last reviewed in December, 1970 |
Quantity | Value | Units | Method | Reference | Comment |
S°gas,1 bar | 327.99 | J/mol*K | Review | Chase, 1998 | Data last reviewed in December, 1970 |
Gas Phase Heat Capacity (Shomate Equation)
Cp° = A + B*t + C*t2 + D*t3 +
E/t2
H° − H°298.15= A*t + B*t2/2 +
C*t3/3 + D*t4/4 − E/t + F − H
S° = A*ln(t) + B*t + C*t2/2 + D*t3/3 −
E/(2*t2) + G
Cp = heat capacity (J/mol*K)
H° = standard enthalpy (kJ/mol)
S° = standard entropy (J/mol*K)
t = temperature (K) / 1000.
View plot Requires a JavaScript / HTML 5 canvas capable browser.
Temperature (K) | 298. to 1200. | 1200. to 6000. |
---|---|---|
A | 50.94857 | 112.9730 |
B | 124.1397 | 10.10315 |
C | -90.90200 | -1.896763 |
D | 26.30627 | 0.124252 |
E | 0.075174 | -11.89520 |
F | -674.5026 | -714.5017 |
G | 356.8663 | 429.2366 |
H | -654.7960 | -654.7960 |
Reference | Chase, 1998 | Chase, 1998 |
Comment | Data last reviewed in December, 1970 | Data last reviewed in December, 1970 |

Gas phase ion energetics data

Data compiled by: Henry M. Rosenstock, Keith Draxl, Bruce W. Steiner, and John T. Herron
Appearance energy determinations
Ion | AE (eV) | Other Products | Method | Reference | Comment |
---|---|---|---|---|---|
K2OH+ | 7.80 ± 0.15 | OH | EI | Gorokhov, Gusarov, et al., 1970 | |
K2O+ | 7.6 ± 0.2 | H2O? | EI | Gorokhov, Gusarov, et al., 1970 |

References

Chase, 1998
Chase, M.W., Jr.,
NIST-JANAF Themochemical Tables, Fourth Edition,
J. Phys. Chem. Ref. Data, Monograph 9, 1998, 1-1951. [all data]
Gorokhov, Gusarov, et al., 1970
Gorokhov, L.N.; Gusarov, A.V.; Panchenkov, I.G.,
Determination of dissociation energies of potassium and caesium hydroxides by electron bombardment,
Zh. Fiz. Khim., 1970, 44, 269, In original 150. [all data]