1-Butanol, 3-methyl-, acetate
- Formula: C7H14O2
- Molecular weight: 130.1849
- IUPAC Standard InChIKey: MLFHJEHSLIIPHL-UHFFFAOYSA-N
- CAS Registry Number: 123-92-2
- Chemical structure:
View 3d structure (requires JavaScript / HTML 5) - Other names: Isopentyl alcohol, acetate; Acetic acid, 3-methylbutyl ester; Banana oil; Isoamyl acetate; Isoamyl ethanoate; Isopentyl acetate; Pear oil; 3-Methyl-1-butyl acetate; 3-Methylbutyl acetate; CH3C(O)O(CH2)2CH(CH3)2; Isopentyl ethanoate; 3-Methyl-1-butanol acetate; 3-Methylbutyl ethanoate; Acetic acid, isopentyl ester; 2-Methylbutyl ethanoate; Isoamylester kyseliny octove; i-Amyl acetate; 3-Methylbutyl ester of acetic acid; β-Methyl butyl acetate; 3-Methyl butyl ester acetic acid; Amyl acetate ester; Amyl acetate, common; Isopentyl ester acetic acid; Acetic acid, isoamyl ester; 3-Methyl-1-butanyl acetate; 3-methyl-but-1-yl acetate; 1-Butanol, 3-methyl-, 1-acetate; NSC 9260; Isopentyl alcohol, acetate pear oil; Jargonelle pear essence; 3-methyl-1-butyl acetate (isoamyl acetate)

Phase change data

Data compiled as indicated in comments:
BS - Robert L. Brown and Stephen E. Stein
TRC - Thermodynamics Research Center, NIST Boulder Laboratories, Chris Muzny director
AC - William E. Acree, Jr., James S. Chickos
Quantity | Value | Units | Method | Reference | Comment |
---|---|---|---|---|---|
Tboil | 414. ± 3. | K | AVG | N/A | Average of 23 values; Individual data points |
Quantity | Value | Units | Method | Reference | Comment |
Tc | 586.1 | K | N/A | Quadri and Kudchadker, 1991 | Uncertainty assigned by TRC = 0.6 K; TRC |
Tc | 599.33 | K | N/A | Brown, 1906 | Uncertainty assigned by TRC = 6. K; TRC |
Quantity | Value | Units | Method | Reference | Comment |
Pc | 27.60 | bar | N/A | Quadri and Kudchadker, 1991 | Uncertainty assigned by TRC = 0.20 bar; TRC |
Quantity | Value | Units | Method | Reference | Comment |
ΔvapH° | 46.4 ± 0.2 | kJ/mol | GS | Verevkin and Heintz, 1999 | Based on data from 278. to 305. K.; AC |
Reduced pressure boiling point
Tboil (K) | Pressure (bar) | Reference | Comment |
---|---|---|---|
415.2 | 1.01 | Aldrich Chemical Company Inc., 1990 | BS |
Enthalpy of vaporization
ΔvapH (kJ/mol) | Temperature (K) | Method | Reference | Comment |
---|---|---|---|---|
46.4 | 300. | N/A | Espinosa Diaz, Guetachew, et al., 1999 | Based on data from 230. to 435. K.; AC |
46.8 ± 0.2 | 292. | GS | Verevkin and Heintz, 1999 | Based on data from 278. to 305. K.; AC |
44.3 | 323. | A | Stephenson and Malanowski, 1987 | Based on data from 308. to 424. K.; AC |
45.1 | 328. | N/A | Terres, Brinkmann, et al., 1959 | Based on data from 313. to 368. K. See also Boublik, Fried, et al., 1984.; AC |
Antoine Equation Parameters
log10(P) = A − (B / (T + C))
P = vapor pressure (bar)
T = temperature (K)
View plot Requires a JavaScript / HTML 5 canvas capable browser.
Temperature (K) | A | B | C | Reference | Comment |
---|---|---|---|---|---|
313.8 to 367.7 | 5.08047 | 1932.043 | -28.698 | Usanovich and Dembitskii, 1959 | Coefficents calculated by NIST from author's data. |

Reaction thermochemistry data

Data compiled by: Michael M. Meot-Ner (Mautner) and Sharon G. Lias
Individual Reactions
By formula: C7H15O2+ + C7H14O2 = (C7H15O2+ • C7H14O2)
Bond type: Hydrogen bonds of the type OH-O between organics
Quantity | Value | Units | Method | Reference | Comment |
---|---|---|---|---|---|
ΔrH° | 38. | kJ/mol | HPMS | Field, 1969 | gas phase; Entropy change is questionable |
Quantity | Value | Units | Method | Reference | Comment |
ΔrS° | -8. | J/mol*K | HPMS | Field, 1969 | gas phase; Entropy change is questionable |

Henry's Law data

Data compiled by: Rolf Sander
Henry's Law constant (water solution)
kH(T) = k°H exp(d(ln(kH))/d(1/T) ((1/T) - 1/(298.15 K)))
k°H = Henry's law constant for solubility in water at 298.15 K (mol/(kg*bar))
d(ln(kH))/d(1/T) = Temperature dependence constant (K)
k°H (mol/(kg*bar)) | d(ln(kH))/d(1/T) (K) | Method | Reference |
---|---|---|---|
2.4 | 5000. | X | N/A |
1.7 | V | N/A |

Ion clustering data

Data compiled by: Michael M. Meot-Ner (Mautner) and Sharon G. Lias
Clustering reactions
By formula: C7H15O2+ + C7H14O2 = (C7H15O2+ • C7H14O2)
Bond type: Hydrogen bonds of the type OH-O between organics
Quantity | Value | Units | Method | Reference | Comment |
---|---|---|---|---|---|
ΔrH° | 38. | kJ/mol | HPMS | Field, 1969 | gas phase; Entropy change is questionable |
Quantity | Value | Units | Method | Reference | Comment |
ΔrS° | -8. | J/mol*K | HPMS | Field, 1969 | gas phase; Entropy change is questionable |

Kovats' RI, non-polar column, isothermal

Column type | Active phase | Temperature (C) | I | Reference | Comment |
---|---|---|---|---|---|
Capillary | HP-101 | 60. | 861.32 | Garay, 2000 | 50. m/0.2 mm/0.2 μm, H2 |
Capillary | SE-30 | 100. | 858. | Tudor and Moldovan, 1999 | |
Capillary | SE-30 | 100. | 857.8 | Tudor, 1997 | 40. m/0.35 mm/0.35 μm |
Capillary | SPB-1 | 60. | 862. | Castello, Vezzani, et al., 1991 | N2; Column length: 60. m; Column diameter: 0.75 mm |
Capillary | OV-101 | 80. | 859.7 | Komárek, Hornová, et al., 1982 | N2; Column length: 15. m; Column diameter: 0.22 mm |
Packed | SE-30 | 150. | 859. | Ashes and Haken, 1974 | Celaton (62-72 mesh); Column length: 3.7 m |
Packed | SE-30 | 100. | 867. | Zarazir, Chovin, et al., 1970 | Chromosorb W; Column length: 2. m |
Packed | SE-30 | 150. | 854. | Germaine and Haken, 1969 | Celite 560; Column length: 3.7 m |

Kovats' RI, non-polar column, temperature ramp

Column type | Active phase | I | Reference | Comment |
---|---|---|---|---|
Capillary | BP-1 | 866. | Srivastava, Ahmad, et al., 2003 | 25. m/0.55 mm/0.25 μm, N2, 5. K/min, 220. C @ 15. min; Tstart: 60. C |
Capillary | BP-1 | 862. | Raina, Lal, et al., 2002 | 60. m/0.32 mm/0.25 μm, N2, 5. K/min; Tstart: 60. C; Tend: 220. C |
Capillary | DB-1 | 867. | Takeoka, Buttery, et al., 1992 | 60. m/0.32 mm/0.25 μm, He, 30. C @ 4. min, 2. K/min; Tend: 210. C |
Capillary | DB-1 | 866. | Takeoka, Buttery, et al., 1992 | 60. m/0.32 mm/0.25 μm, He, 30. C @ 4. min, 2. K/min; Tend: 210. C |
Capillary | DB-1 | 866. | Takeoka, Buttery, et al., 1992 | 60. m/0.32 mm/0.25 μm, He, 30. C @ 4. min, 2. K/min; Tend: 210. C |
Capillary | DB-1 | 865. | Takeoka, Buttery, et al., 1992 | 60. m/0.32 mm/0.25 μm, He, 30. C @ 4. min, 2. K/min; Tend: 210. C |

Kovats' RI, non-polar column, custom temperature program

Column type | Active phase | I | Reference | Comment |
---|---|---|---|---|
Packed | Apiezon L | 836. | Rasmussen, 1983 | Chromosorb W HMDS HP (00-120 mesh); Column length: 1.2 m; Program: not specified |
Capillary | SE-30 | 859. | Chretien and Dubois, 1978 | Program: not specified |

Kovats' RI, polar column, isothermal

Column type | Active phase | Temperature (C) | I | Reference | Comment |
---|---|---|---|---|---|
Capillary | Supelcowax-10 | 60. | 1131. | Castello, Vezzani, et al., 1991 | N2; Column length: 60. m; Column diameter: 0.75 mm |
Packed | Carbowax 20M | 100. | 1096. | Kevei and Kozma, 1976 | Chromosorb |
Packed | Carbowax 20M | 100. | 1135. | Zarazir, Chovin, et al., 1970 | Chromosorb W; Column length: 2. m |

Kovats' RI, polar column, temperature ramp

Column type | Active phase | I | Reference | Comment |
---|---|---|---|---|
Capillary | CBP-20 | 1125. | Shimadzu, 2003 | 25. m/0.2 mm/0.25 μm, He, 50. C @ 5. min, 4. K/min; Tend: 200. C |
Capillary | DB-Wax | 1126. | Tatsuka, Suekane, et al., 1990 | 60. m/0.25 mm/0.25 μm, He, 40. C @ 5. min, 3. K/min; Tend: 200. C |
Capillary | DB-Wax | 1126. | Tatsuka, Suekane, et al., 1990 | 60. m/0.25 mm/0.25 μm, He, 40. C @ 5. min, 3. K/min; Tend: 200. C |
Capillary | DB-Wax | 1124. | Tatsuka, Suekane, et al., 1990 | 60. m/0.25 mm/0.25 μm, He, 40. C @ 5. min, 3. K/min; Tend: 200. C |
Capillary | DB-Wax | 1126. | Tatsuka, Suekane, et al., 1990 | 60. m/0.25 mm/0.25 μm, He, 40. C @ 5. min, 3. K/min; Tend: 200. C |
Capillary | DB-Wax | 1130. | Umano, Shoji, et al., 1986 | N2, 60. C @ 10. min, 2. K/min; Column length: 30. m; Column diameter: 0.25 mm; Tend: 200. C |
Capillary | Carbowax 20M | 1120. | Buttery, Seifert, et al., 1982 | He, 1. K/min; Column length: 150. m; Column diameter: 0.64 mm; Tstart: 50. C; Tend: 170. C |
Capillary | Carbowax 20M | 1102. | Toda, Yamaguchi, et al., 1982 | 2. K/min; Column length: 50. m; Column diameter: 0.28 mm; Tstart: 80. C; Tend: 200. C |
Capillary | Carbowax 20M | 1105. | Toda, Yamaguchi, et al., 1982 | 2. K/min; Column length: 50. m; Column diameter: 0.28 mm; Tstart: 80. C; Tend: 200. C |
Capillary | Carbowax 20M | 1117. | Spencer, Pangborn, et al., 1978 | N2, 3. K/min; Column length: 30. m; Column diameter: 0.26 mm; Tstart: 70. C; Tend: 170. C |
Capillary | Carbowax 20M | 1121. | Spencer, Pangborn, et al., 1978 | N2, 3. K/min; Column length: 30. m; Column diameter: 0.26 mm; Tstart: 70. C; Tend: 170. C |
Capillary | Carbowax 20M | 1126. | Tressl, Friese, et al., 1978 | He, 2. K/min; Column length: 50. m; Column diameter: 0.28 mm; Tstart: 70. C; Tend: 190. C |

Kovats' RI, polar column, custom temperature program

Column type | Active phase | I | Reference | Comment |
---|---|---|---|---|
Capillary | Carbowax 20M | 1111. | Garruti, Franco, et al., 2001 | H2; Column length: 30. m; Column diameter: 0.25 mm; Program: 50 0C (8 min) 4 K/min -> 110 0C 16 K/min -> 200 0C |
Capillary | Carbowax 20M | 1130. | Brander, Kepner, et al., 1980 | Program: not specified |
Capillary | Carbowax 20M | 1131. | Brander, Kepner, et al., 1980 | Program: not specified |
Packed | Carbowax 20M | 1101. | Kevei and Kozma, 1976 | Chromosorb; Program: not specified |

Van Den Dool and Kratz RI, non-polar column, temperature ramp

Column type | Active phase | I | Reference | Comment |
---|---|---|---|---|
Capillary | 5 % Phenyl methyl siloxane | 883. | Zaikin, 2010 | 30. m/0.25 mm/0.25 μm, 15. K/min, 270. C @ 15. min; Tstart: 60. C |
Capillary | DB-5 | 878. | Mahattanatawee K., Perez-Cacho P.R., et al., 2007 | 30. m/0.32 mm/0.5 μm, He, 7. K/min, 265. C @ 5. min; Tstart: 40. C |
Capillary | HP-5 | 876. | Quijano, Salamanca, et al., 2007 | 30. m/0.25 mm/0.25 μm, He, 50. C @ 4. min, 4. K/min, 250. C @ 10. min |
Capillary | DB-5 | 869. | Fang and Qian, 2005 | 30. m/0.32 mm/1. μm, N2, 40. C @ 2. min, 4. K/min, 230. C @ 10. min |
Capillary | HP-5MS | 876. | Pino, Mesa, et al., 2005 | 30. m/0.25 mm/0.25 μm, He, 60. C @ 2. min, 4. K/min, 250. C @ 20. min |
Capillary | CP-Sil 8CB-MS | 877. | Hierro, de la Hoz, et al., 2004 | 60. m/0.25 mm/0.25 μm, 40. C @ 2. min, 4. K/min, 280. C @ 5. min |
Capillary | SPB-5 | 876. | Pino, Marbot, et al., 2004 | 30. m/0.25 mm/0.25 μm, He, 60. C @ 2. min, 4. K/min, 250. C @ 20. min |
Capillary | SPB-5 | 862. | Rodríguez-Burruezo, Kollmannsberger, et al., 2004 | 30. m/0.53 mm/1.5 μm, He, 5. K/min; Tstart: 100. C; Tend: 250. C |
Capillary | DB-5 | 876. | Bader, Flamini, et al., 2003 | 30. m/0.25 mm/0.25 μm, He, 3. K/min; Tstart: 60. C; Tend: 240. C |
Capillary | Ultra-2 | 875. | Ceva-Antunes, Bizzo, et al., 2003 | 25. m/0.25 mm/0.33 μm, H2, 40. C @ 2. min, 3. K/min, 280. C @ 10. min |
Capillary | SPB-5 | 876. | Pino, Marbot, et al., 2003 | 30. m/0.25 mm/0.25 μm, He, 60. C @ 2. min, 4. K/min, 250. C @ 20. min |
Capillary | DB-1 | 855.5 | Sun and Stremple, 2003 | 30. m/0.25 mm/0.25 μm, He, 3. K/min; Tstart: 40. C; Tend: 325. C |
Capillary | CP Sil 5 CB | 851. | Pino, Marbot, et al., 2002 | 25. m/0.25 mm/0.25 μm, N2, 60. C @ 6. min, 4. K/min; Tend: 280. C |
Capillary | SPB-5 | 876. | Pino, Marbot, et al., 2002, 2 | 30. m/0.25 mm/0.25 μm, He, 60. C @ 2. min, 4. K/min, 250. C @ 20. min |
Capillary | DB-5 | 876. | Isidorov, Zenkevich, et al., 2001 | He, 3. K/min; Column length: 30. m; Column diameter: 0.25 mm; Tstart: 50. C; Tend: 250. C |
Capillary | SPB-1 | 860. | Larráyoz, Addis, et al., 2001 | 30. m/0.32 mm/4. μm, He, 45. C @ 13. min, 5. K/min, 240. C @ 5. min |
Capillary | CP Sil 5 CB | 855. | Pino, Marbot, et al., 2001 | 50. m/0.32 mm/0.4 μm, He, 60. C @ 10. min, 3. K/min, 280. C @ 60. min |
Capillary | HP-5 | 883. | Shalit, Katzir, et al., 2001 | He, 50. C @ 1. min, 4. K/min; Column length: 30. m; Column diameter: 0.25 mm; Tend: 200. C |
Capillary | DB-5 | 875. | Moio, Piombino, et al., 2000 | 30. m/0.32 mm/1. μm, H2, 3. K/min; Tstart: 40. C; Tend: 210. C |
Capillary | DB-5 | 876. | Moio, Piombino, et al., 2000 | 30. m/0.32 mm/1. μm, H2, 3. K/min; Tstart: 40. C; Tend: 210. C |
Capillary | DB-5 | 878. | Moio, Piombino, et al., 2000 | 30. m/0.32 mm/1. μm, H2, 3. K/min; Tstart: 40. C; Tend: 210. C |
Capillary | CP Sil 8 CB | 867. | Yassaa, Meklati, et al., 2000 | 25. m/0.2 mm/0.25 μm, 40. C @ 8. min, 2. K/min; Tend: 200. C |
Capillary | BPX-5 | 884. | Aaslyng, Elmore, et al., 1998 | 50. m/0.32 mm/0.50 μm, He, 4. K/min; Tstart: 40. C; Tend: 280. C |
Capillary | DB-5 | 874.6 | Komárek, Richter, et al., 1998 | He, 5.5 K/min; Column length: 20. m; Column diameter: 0.25 mm; Tstart: 50. C; Tend: 350. C |
Capillary | DB-5 | 875. | Moio and Addeo, 1998 | 30. m/0.32 mm/1. μm, H2, 3. K/min; Tstart: 40. C; Tend: 210. C |
Capillary | DB-5 | 876. | Moio and Addeo, 1998 | 30. m/0.32 mm/1. μm, H2, 3. K/min; Tstart: 40. C; Tend: 210. C |
Capillary | DB-5 | 876. | Moio and Addeo, 1998 | 30. m/0.32 mm/1. μm, H2, 3. K/min; Tstart: 40. C; Tend: 210. C |
Capillary | DB-1 | 858. | Bartelt, 1997 | 30. m/0.32 mm/5. μm, He, 35. C @ 1. min, 10. K/min; Tend: 270. C |
Capillary | DB-1 | 858. | Lee, DeMilo, et al., 1997 | 60. m/0.248 mm/0.25 μm, He, 5. K/min; Tstart: 50. C; Tend: 250. C |
Capillary | DB-1 | 858. | Lee, DeMilo, et al., 1997 | 60. m/0.248 mm/0.25 μm, He, 5. K/min; Tstart: 50. C; Tend: 250. C |
Capillary | DB-1 | 859. | Lee, DeMilo, et al., 1997 | 60. m/0.248 mm/0.25 μm, He, 5. K/min; Tstart: 50. C; Tend: 250. C |
Capillary | DB-1 | 855. | DeMilo, Lee, et al., 1996 | 30. m/0.248 mm/0.25 μm, He, 50. C @ 5. min, 5. K/min; Tend: 250. C |
Capillary | DB-1 | 856. | DeMilo, Lee, et al., 1996 | 30. m/0.248 mm/0.25 μm, He, 50. C @ 5. min, 5. K/min; Tend: 250. C |
Capillary | OV-101 | 859. | Chisholm, Guiher, et al., 1994 | 35. C @ 3. min, 6. K/min; Column length: 15. m; Column diameter: 0.32 mm; Tend: 250. C |
Capillary | DB-5 | 860. | Guichard and Souty, 1988 | H2, 30. C @ 5. min, 1.5 K/min; Column length: 0.32 m; Column diameter: 1. mm; Tend: 180. C |
Capillary | SE-30 | 853. | Korhonen, 1984 | 6. K/min; Column length: 25. m; Column diameter: 0.3 mm; Tstart: 50. C |
Capillary | SE-30 | 853. | Korhonen, 1984 | 6. K/min; Column length: 25. m; Column diameter: 0.3 mm; Tstart: 50. C |
Capillary | SE-52 | 885. | de Pooter, Montens, et al., 1983 | He, 1. K/min; Column length: 150. m; Column diameter: 0.6 mm; Tstart: 10. C; Tend: 200. C |
Packed | SE-30 | 853. | van den Dool and Kratz, 1963 | Celite; Tstart: 75. C; Tend: 228. C |

Van Den Dool and Kratz RI, non-polar column, custom temperature program

Column type | Active phase | I | Reference | Comment |
---|---|---|---|---|
Capillary | VF-5MS | 875.7 | Tret'yakov, 2008 | 30. m/0.25 mm/0.25 μm, He; Program: Multi-step temperature program; T(initial)=60C; T(final)=270C |
Capillary | DB-5 | 874. | Sampaio and Nogueira, 2006 | 30. m/0.25 mm/0.25 μm; Program: 40C(2min) => 4C/min => 220C => 20C/min => 280C |
Capillary | HP-5MS | 873. | Bonaiti, Irlinger, et al., 2005 | 30. m/0.25 mm/0.25 μm, He; Program: 5C(8min) => 3C/min => 20C => 10C/min => 150C(10min) |
Capillary | DB-5 | 875. | Campo, Ferreira, et al., 2005 | Program: not specified |
Capillary | DB-5 | 855. | Boscaini, van Ruth, et al., 2003 | 60. m/0.32 mm/1. μm, He; Program: 40C(4min) => 2C/min => 90C => 4C/min => 130C 8C/min => 250C |
Capillary | DB-5 | 881. | Mayr, van Ruth, et al., 2003 | 60. m/0.32 mm/1. μm, He; Program: 40 C(4min) => 2C/min => 90C => 4C/min => 130C => 8C/min => 250C |
Capillary | DB-5 | 878. | Kirchhoff and Schieberle, 2002 | 25. m/0.32 mm/0.25 μm, He; Program: 35C (2min) => 40C/min => 50C (2min) => 4C/min => 240C (10min) |
Capillary | DB-5 | 876. | Beaulieu and Grimm, 2001 | 30. m/0.25 mm/0.25 μm, He; Program: 50C (1min) => 5C/min => 100C => 10C/min => 250C (9min) |
Capillary | DB-5MS | 872. | Boulanger and Crouzet, 2001 | 30. m/0.25 mm/0.25 μm, H2; Program: 40C (5min) => 2C/min => 200C => 5C/min => 250C (15min) |
Capillary | HP-5 | 867. | Isidorov, Krajewska, et al., 2001 | 30. m/0.25 mm/0.25 μm, He; Program: 50C => 6C/min => 100C => 4C/min => 280C |
Capillary | DB-1 | 859. | Eri, Khoo, et al., 2000 | 60. m/0.25 mm/0.25 μm, He; Program: -20C (5min) => 10C/min => 100C => 4C/min => 200C => 10C/min => 280C |
Capillary | SE-54 | 877. | Fickert and Schieberle, 1998 | 25. m/0.32 mm/0.5 μm, He; Program: 35C (2min) => 4C/min => 150C => 10C/min => 240C |
Capillary | SE-52 | 876. | Mondello, Dugo, et al., 1995 | 60. m/0.32 mm/0.40 μm, He; Program: 45 C (6 min) 3 C/min -> 111 0C 2 C/min -> 160 C 3 C/min -> 300 C (15 min) |

Van Den Dool and Kratz RI, polar column, temperature ramp

Column type | Active phase | I | Reference | Comment |
---|---|---|---|---|
Capillary | DB-Wax Etr | 1115. | Aubert and Chanforan, 2007 | 30. m/0.25 mm/0.25 μm, 40. C @ 3. min, 5. K/min, 250. C @ 15. min |
Capillary | DB-Wax | 1121. | Botelho, Caldeira, et al., 2007 | 30. m/0.25 mm/0.25 μm, He, 50. C @ 2. min, 3.5 K/min, 180. C @ 25. min |
Capillary | Innowax | 1132. | Botelho, Caldeira, et al., 2007 | 30. m/0.25 mm/0.25 μm, H2, 45. C @ 5. min, 3.5 K/min, 210. C @ 20. min |
Capillary | DB-Wax | 1143. | Mahattanatawee K., Perez-Cacho P.R., et al., 2007 | 30. m/0.32 mm/0.5 μm, He, 7. K/min, 240. C @ 5. min; Tstart: 40. C |
Capillary | DB-Wax Etr | 1123. | Aubert C. and Pitrat M., 2006 | 30. m/0.25 mm/0.25 μm, He, 40. C @ 3. min, 5. K/min, 250. C @ 15. min |
Capillary | DB-Wax | 1126. | Gurbuz O., Rouseff J.M., et al., 2006 | 60. m/0.25 mm/0.25 μm, He, 7. K/min, 265. C @ 5. min; Tstart: 40. C |
Capillary | DB-Wax | 1125. | Gurbuz O., Rouseff J.M., et al., 2006 | 30. m/0.32 mm/0.5 μm, He, 7. K/min, 265. C @ 5. min; Tstart: 40. C |
Capillary | DB-Wax | 1112. | Osorio, Alarcon, et al., 2006 | 30. m/0.25 mm/0.25 μm, He, 50. C @ 4. min, 4. K/min, 220. C @ 20. min |
Capillary | DB-Wax | 1134. | Petka, Ferreira, et al., 2006 | 30. m/0.32 mm/0.5 μm, 40. C @ 3. min, 5. K/min, 200. C @ 8. min |
Capillary | Stabilwax | 1114. | Fang and Qian, 2005 | 30. m/0.32 mm/1. μm, N2, 40. C @ 2. min, 4. K/min, 230. C @ 10. min |
Capillary | Innowax | 1125. | Pena, Barciela, et al., 2005 | 30. m/0.25 mm/0.25 μm, He, 40. C @ 5. min, 5. K/min, 200. C @ 2. min |
Capillary | Supelcowax-10 | 1139. | Riu-Aumatell, Lopez-Tamames, et al., 2005 | 30. m/0.25 mm/0.25 μm, He, 60. C @ 5. min, 3. K/min, 240. C @ 10. min |
Capillary | CP-Wax 52CB | 1121. | Ferrari, Lablanquie, et al., 2004 | 30. m/0.25 mm/0.2 μm, He, 80. C @ 4. min, 10. K/min; Tend: 240. C |
Capillary | ZB-Wax | 1117. | Ledauphin, Saint-Clair, et al., 2004 | 30. m/0.25 mm/0.15 μm, He, 35. C @ 10. min, 1.8 K/min, 220. C @ 10. min |
Capillary | DB-Wax Etr | 1118. | Ménager, Jost, et al., 2004 | 30. m/0.25 mm/0.25 μm, He, 40. C @ 3. min, 3. K/min, 245. C @ 20. min |
Capillary | DB-Wax | 1115. | Varming, Petersen, et al., 2004 | 30. m/0.25 mm/0.25 μm, He, 40. C @ 10. min, 6. K/min, 240. C @ 25. min |
Capillary | AT-Wax | 1107. | Pino, Marbot, et al., 2001 | 60. m/0.32 mm/0.25 μm, He, 65. C @ 10. min, 2. K/min, 250. C @ 60. min |
Capillary | DB-FFAP | 1116. | Charles, Martin, et al., 2000 | 30. m/0.32 mm/0.25 μm, H2, 40. C @ 2. min, 5. K/min; Tend: 240. C |
Capillary | Supelcowax-10 | 1126. | Chung, 2000 | 60. m/0.25 mm/0.25 μm, He, 2. K/min, 195. C @ 90. min; Tstart: 35. C |
Capillary | Supelcowax-10 | 1126. | Chung, 1999 | 60. m/0.25 mm/0.25 μm, He, 35. C @ 5. min, 2. K/min, 195. C @ 90. min |
Capillary | CP-Wax 52CB | 1118. | Chyau, Mau, et al., 1996 | 50. m/0.23 mm/0.12 μm, H2, 50. C @ 10. min, 1.5 K/min, 200. C @ 10. min |
Capillary | Carbowax 20M | 1119. | Mondello, Dugo, et al., 1995 | 60. m/0.32 mm/0.425 μm, He, 45. C @ 3. min, 3. K/min, 300. C @ 20. min |
Capillary | DB-Wax | 1123. | Sumitani, Suekane, et al., 1994 | He, 40. C @ 5. min, 3. K/min; Column length: 60. m; Column diameter: 0.25 mm; Tend: 200. C |
Capillary | DB-Wax | 1127. | Stashenko, Macku, et al., 1992 | He, 35. C @ 5. min, 3. K/min; Column length: 60. m; Column diameter: 0.25 mm; Tend: 180. C |
Capillary | DB-Wax | 1123. | Umano, Hagi, et al., 1992 | He, 40. C @ 10. min, 2. K/min; Column length: 30. m; Column diameter: 0.25 mm; Tend: 200. C |
Capillary | Carbowax 20M | 1120. | Suárez and Duque, 1991 | 2. K/min; Column length: 25. m; Column diameter: 0.31 mm; Tstart: 50. C; Tend: 200. C |
Capillary | Carbowax 20M | 1120. | Suárez and Duque, 1991 | 2. K/min; Column length: 25. m; Column diameter: 0.31 mm; Tstart: 50. C; Tend: 200. C |
Capillary | DB-Wax | 1115. | Fröhlich, Duque, et al., 1989 | 30. m/0.25 mm/0.25 μm, He, 50. C @ 3. min, 4. K/min; Tend: 250. C |
Capillary | DB-Wax | 1115. | Fröhlich, Duque, et al., 1989 | 30. m/0.25 mm/0.25 μm, He, 50. C @ 3. min, 4. K/min; Tend: 250. C |
Capillary | OV-351 | 1117. | Korhonen, 1984 | 6. K/min; Column length: 25. m; Column diameter: 0.32 mm; Tstart: 50. C |
Capillary | OV-351 | 1117. | Korhonen, 1984 | 6. K/min; Column length: 25. m; Column diameter: 0.32 mm; Tstart: 50. C |
Packed | Carbowax 20M | 1116. | van den Dool and Kratz, 1963 | Celite 545, 4.6 K/min; Tstart: 75. C; Tend: 228. C |

Van Den Dool and Kratz RI, polar column, custom temperature program

Column type | Active phase | I | Reference | Comment |
---|---|---|---|---|
Capillary | Supelcowax-10 | 1127. | Bianchi, Cantoni, et al., 2007 | 30. m/0.25 mm/0.25 μm; Program: 35C(8min) => 4C/min => 60C => 6C/min => 160C => 20C/min => 220C(1min) |
Capillary | Supelcowax-10 | 1125. | Bianchi, Careri, et al., 2007 | 30. m/0.25 mm/0.25 μm, He; Program: 35C(8min) => 4C/min => 60C => 6C/min => 160C => 20C/min => 200C(1min) |
Capillary | Supelcowax-10 | 1127. | Bianchi, Careri, et al., 2007 | 30. m/0.25 mm/0.25 μm, He; Program: 35C(8min) => 4C/min => 60C => 6C/min => 160C => 20C/min => 200C(1min) |
Capillary | DB-Wax | 1137. | Escudero, Campo, et al., 2007 | 30. m/0.32 mm/0.5 μm, H2; Program: 40C(5min) => 4C/min => 100C6C/min => 136C => 3C/min => 220C (10min) |
Capillary | DB-Wax | 1132. | Selli, Canbas, et al., 2006 | 30. m/0.32 mm/0.5 μm, H2; Program: 60C(3min) => 2C/min => 220C => 3C/min => 245C (20min) |
Capillary | DB-Wax | 1132. | Selli, Canbas, et al., 2006, 2 | 30. m/0.32 mm/0.5 μm, H2; Program: 60C(3min) => 2C/min => 220C => 3C/min => 245C(20min) |
Capillary | SOLGel-Wax | 1112. | Aubert, Baumann, et al., 2005 | 30. m/0.25 mm/0.25 μm, He; Program: 35C(5min) => 3C/min => 150C => 5C/min => 250C(10 min) |
Capillary | Supelcowax-10 | 1118. | Howard, Mike, et al., 2005 | 30. m/0.25 mm/0.25 μm, He; Program: 35C(8min) => 3C/min => 134C => 20C/min => 250C(3.2min) |
Capillary | CP-Wax 52CB | 1113. | Kaack, Christensen, et al., 2005 | 50. m/0.25 mm/0.2 μm, He; Program: 33C(1.5min) => 1.5C/min => 60C(4min) => 2C/min => 100C => 8C/min => 220C(15min) |
Capillary | DB-Wax | 1113. | Ferrari, Lablanquie, et al., 2004 | 60. m/0.25 mm/0.25 μm, He; Program: 35C(0.7min) => 20C/min => 70C => 4C/min => 240C |
Capillary | Stabilwax | 1125. | Klesk, Qian, et al., 2004 | 30. m/0.32 mm/1. μm, He; Program: 40C (2min) => 5C/min => 100C => 4C/min => 230C (10min) |
Capillary | DB-Wax | 1132. | Selli, Cabaroglu, et al., 2004 | 30. m/0.32 mm/0.5 μm, H2; Program: 60C(3min) => 2C/min => 220C => 3C/min => 245C (20min) |
Capillary | Carbowax 20M | 1125. | Boido, Lloret, et al., 2003 | 25. m/0.32 mm/0.25 μm, H2; Program: 40C (8min) => 3C/min => 180C => 20C/min => 230C |
Capillary | Supelcowax-10 | 1129. | da Porto, Pizzale, et al., 2003 | 30. m/0.32 mm/0.3 μm; Program: 60C(8min) => 8C/min => 170C => 13C/min => 240C(20min) |
Capillary | FFAP | 1115. | Kirchhoff and Schieberle, 2002 | 30. m/0.32 mm/0.25 μm, He; Program: 35C (2min) => 60C/min => 50C (2min) => 6C/min => 240C (10min) |
Capillary | HP-Innowax | 1132. | Koprivnjak, Conte, et al., 2002 | 30. m/0.32 mm/0.5 μm, He; Program: 40C(4min) => 10C/min => 70C => 5C/min => 150C => 10C/min => 250C (10min) |
Capillary | DB-Wax | 1125. | Nurgel, Erten, et al., 2002 | 30. m/0.32 mm/0.5 μm, H2; Program: 60C (3min) => 2C/min => 220C => 3C/min => 245C (20min) |
Capillary | DB-Wax | 1114. | Cantergiani, Brevard, et al., 2001 | 30. m/0.25 mm/0.25 μm; Program: 20C(30s) => fast => 60C => 4C/min => 220C (20min) |
Capillary | FFAP | 1122. | Fickert and Schieberle, 1998 | 25. m/0.32 mm/0.5 μm, He; Program: 35C (2min) => 40C/min => 60C => 6C/min => 230C (10min) |
Capillary | FFAP | 1128. | Yasuhara, 1987 | 50. m/0.25 mm/0.25 μm, He; Program: 20C (5min) => 2C/min => 70C => 4C/min => 210C |
Capillary | Carbowax 20M | 1128. | Whitfield, Shea, et al., 1981 | Column length: 150. m; Column diameter: 0.75 mm; Program: not specified |

Normal alkane RI, non-polar column, isothermal

Column type | Active phase | Temperature (C) | I | Reference | Comment |
---|---|---|---|---|---|
Capillary | DB-1 | 60. | 858. | Shimadzu, 2003, 2 | 60. m/0.32 mm/1. μm, He |
Packed | SE-30 | 70. | 870. | Yabumoto, Jennings, et al., 1977 |

Normal alkane RI, non-polar column, temperature ramp

Column type | Active phase | I | Reference | Comment |
---|---|---|---|---|
Capillary | Optima-5 MS | 876. | Goeminne, Vandendriessche, et al., 2012 | 30. m/0.25 mm/0.25 μm, Helium, 35. C @ 3. min, 10. K/min, 250. C @ 5. min |
Capillary | VF-5 MS | 879. | Leffingwell and Alford, 2011 | 60. m/0.32 mm/0.25 μm, Helium, 2. K/min, 260. C @ 28. min; Tstart: 30. C |
Capillary | VF-5 MS | 883. | Leffingwell and Alford, 2011 | 60. m/0.32 mm/0.25 μm, Helium, 2. K/min, 260. C @ 28. min; Tstart: 30. C |
Capillary | DB-1-MS | 865. | Takeoka, Hobbs, et al., 2010 | 60. m/0.25 mm/0.25 μm, Helium, 30. C @ 4. min, 2. K/min, 200. C @ 35. min |
Capillary | SE-54 | 878. | Laselan, Buettner, et al., 2009 | 30. m/0.32 mm/0.25 μm, 0. C @ 2. min, 6. K/min; Tend: 200. C |
Capillary | HP-5 MS | 876. | Forero, Quijano, et al., 2008 | 30. m/0.25 mm/0.25 μm, Helium, 50. C @ 4. min, 4. K/min, 230. C @ 10. min |
Capillary | DB-1 | 852. | Kumazawa, Itobe, et al., 2008 | 30. m/0.25 mm/0.25 μm, He, 5. K/min; Tstart: 30. C; Tend: 210. C |
Capillary | ZB-1 | 878. | Mierendorff, Stahl-Biskup, et al., 2008 | 30. m/0.25 mm/0.25 μm, Nitrogen, 3. K/min; Tstart: 45. C; Tend: 230. C |
Capillary | RTX-5 | 881. | Setkova, Risticevic, et al., 2007 | 10. m/0.18 mm/0.2 μm, He, 40. C @ 0.5 min, 50. K/min, 275. C @ 0.5 min |
Capillary | DB-5 | 875. | Xu, Fan, et al., 2007 | 30. m/0.32 mm/0.25 μm, He, 40. C @ 2. min, 4. K/min, 250. C @ 5. min |
Capillary | DB-5 | 875. | Fan and Qian, 2006 | 30. m/0.32 mm/1. μm, He, 40. C @ 2. min, 4. K/min, 250. C @ 15. min |
Capillary | DB-5 | 878. | Fan and Qian, 2006, 2 | 30. m/0.32 mm/1. μm, N2, 40. C @ 2. min, 6. K/min, 230. C @ 15. min |
Capillary | DB-5 | 877. | de Souza, Vásquez, et al., 2006 | He, 35. C @ 3. min, 6. K/min; Column length: 13.5 m; Column diameter: 0.32 mm; Tend: 225. C |
Capillary | DB-5 | 877. | El-Sayed, Heppelthwaite, et al., 2005 | 30. m/0.25 mm/0.25 μm, 40. C @ 2. min, 4. K/min; Tend: 240. C |
Capillary | DB-5 | 875. | Fan and Qian, 2005 | 30. m/0.32 mm/0.25 μm, N2, 40. C @ 2. min, 4. K/min, 250. C @ 5. min |
Capillary | HP-5 | 882.6 | Leffingwell and Alford, 2005 | 60. m/0.32 mm/0.25 μm, He, 30. C @ 2. min, 2. K/min, 260. C @ 28. min |
Capillary | HP-5MS | 876. | Tesevic, Nikicevic, et al., 2005 | 30. m/0.25 mm/0.25 μm, He, 4.3 K/min; Tstart: 60. C; Tend: 285. C |
Capillary | HP-5 | 865. | Azodanlou, Darbellay, et al., 2003 | 25. m/0.2 mm/0.33 μm, He, 4. K/min, 190. C @ 5. min; Tstart: 40. C |
Capillary | SPB-5 | 878. | Ledauphin, Guichard, et al., 2003 | 30. m/0.32 mm/0.25 μm, He, 40. C @ 1. min, 5. K/min, 220. C @ 20. min |
Capillary | ZB-1 | 878. | Mierendorff, Stahl-Biskup, et al., 2003 | 30. m/0.25 mm/0.25 μm, N2, 3. K/min; Tstart: 45. C; Tend: 230. C |
Capillary | OV-101 | 858. | Murakami, Goldstein, et al., 2003 | 12. m/0.32 mm/0.32 μm, 35. C @ 3. min, 6. K/min; Tend: 225. C |
Capillary | SPB-1 | 864. | Vichi, Pizzale, et al., 2003 | 30. m/0.25 mm/0.25 μm, He, 40. C @ 10. min, 3. K/min; Tend: 200. C |
Capillary | HP-5 | 876. | Isidorov and Jdanova, 2002 | 3. K/min; Column length: 30. m; Column diameter: 0.25 mm; Tstart: 50. C; Tend: 200. C |
Capillary | HP-5 | 875. | Gallori, Flamini, et al., 2001 | 30. m/0.25 mm/0.25 μm, N2, 60. C @ 10. min, 5. K/min; Tend: 220. C |
Capillary | DB-5 | 880. | Kotseridis and Baumes, 2000 | 30. m/0.32 mm/0.5 μm, H2, 60. C @ 3. min, 3. K/min, 245. C @ 20. min |
Capillary | Methyl Silicone | 865. | Vendramini and Trugo, 2000 | 50. m/0.25 mm/0.5 μm, H2, 40. C @ 0.5 min, 4. K/min; Tend: 260. C |
Capillary | BP-5 | 886. | Lopez, Ferreira, et al., 1999 | 50. m/0.32 mm/1. μm, He, 40. C @ 5. min, 2. K/min; Tend: 190. C |
Capillary | OV-1 | 867. | Oberhofer, Nikiforov, et al., 1999 | 25. m/0.25 mm/0.25 μm, H2, 40. C @ 5. min, 3. K/min, 220. C @ 5. min |
Capillary | HP-1 | 860. | Ong and Acree, 1998 | 4. K/min; Column length: 25. m; Column diameter: 0.32 mm; Tstart: 35. C; Tend: 250. C |
Capillary | HP-1 | 860. | Ong, Acree, et al., 1998 | 4. K/min; Column length: 25. m; Column diameter: 0.32 mm; Tstart: 35. C; Tend: 250. C |
Capillary | HP-5 | 878. | Larsen and Frisvad, 1995 | 35. C @ 2. min, 6. K/min; Tend: 200. C |
Capillary | DB-5 MS | 864. | Gomez and Ledbetter, 1994 | Helium, 4. K/min; Column length: 30. m; Column diameter: 0.25 mm; Tstart: 50. C; Tend: 250. C |
Capillary | OV-101 | 860. | Egolf and Jurs, 1993 | 2. K/min; Column length: 50. m; Column diameter: 0.22 mm; Tstart: 80. C; Tend: 200. C |
Capillary | DB-5 | 876. | Shimoda, Shibamoto, et al., 1993 | 60. m/0.25 mm/0.25 μm, He, 40. C @ 2. min, 3. K/min; Tend: 200. C |
Capillary | DB-1 | 853. | Shiota, 1993 | 30. m/0.25 mm/0.25 μm, He, 50. C @ 5. min, 3. K/min; Tend: 240. C |
Capillary | DB-1 | 856. | Shiota, 1993 | 30. m/0.25 mm/0.25 μm, He, 50. C @ 5. min, 3. K/min; Tend: 240. C |
Capillary | DB-1 | 850. | Shiota, 1993 | 30. m/0.25 mm/0.25 μm, He, 50. C @ 3. min, 5. K/min; Tend: 240. C |
Capillary | DB-1 | 856. | Shiota, 1993 | 30. m/0.25 mm/0.25 μm, He, 50. C @ 3. min, 5. K/min; Tend: 240. C |
Capillary | DB-1 | 857. | Peppard, 1992 | 30. m/0.25 mm/1.0 μm, He, 3. K/min, 250. C @ 30. min; Tstart: 40. C |
Capillary | DB-1 | 860. | Peppard, 1992 | 30. m/0.25 mm/1.0 μm, He, 3. K/min, 250. C @ 30. min; Tstart: 40. C |
Capillary | OV-101 | 860. | Anker, Jurs, et al., 1990 | 2. K/min; Column length: 50. m; Column diameter: 0.28 mm; Tstart: 80. C; Tend: 200. C |
Capillary | DB-1 | 866. | Takeoka and Butter, 1989 | He, 30. C @ 4. min, 2. K/min; Column length: 60. m; Column diameter: 0.32 mm; Tend: 210. C |
Capillary | DB-1 | 866. | Takeoka and Butter, 1989 | He, 30. C @ 4. min, 2. K/min; Column length: 60. m; Column diameter: 0.32 mm; Tend: 210. C |
Capillary | OV-101 | 860. | del Rosario, de Lumen, et al., 1984 | He, 0. C @ 1. min, 3. K/min; Column length: 50. m; Column diameter: 0.31 mm; Tend: 225. C |
Capillary | SE-30 | 861. | Dirinck, de Pooter, et al., 1981 | N2, 2. K/min; Column length: 200. m; Column diameter: 0.6 mm; Tstart: 20. C; Tend: 220. C |
Capillary | OV-1 | 860. | Schreyen, Dirinck, et al., 1979 | N2, 1. K/min; Column length: 183. m; Column diameter: 0.762 mm; Tstart: 0. C; Tend: 230. C |

Normal alkane RI, non-polar column, custom temperature program

Column type | Active phase | I | Reference | Comment |
---|---|---|---|---|
Capillary | CP-Sil 5 CB | 852. | Collin, Nizet, et al., 2012 | 50. m/0.32 mm/1.20 μm, Nitrogen; Program: 36 0C 20 0C/min -> 85 0C 1 0C/min -> 145 0C 3 0C/min -> 250 0C (30 min) |
Capillary | CP-Sil 5 CB | 849. | Collin, Nizet, et al., 2012, 2 | 50. m/0.32 mm/1.20 μm, Nitrogen; Program: 36 0C 20 0C/min -> 85 0C 1 0C/min -> 145 0C 3 0C/min -> 250 0C |
Capillary | Siloxane, 5 % Ph | 864. | VOC BinBase, 2012 | Program: not specified |
Capillary | HP-5 | 882. | Citron, Riclea, et al., 2011 | Program: not specified |
Capillary | CP-Sil 8 CB | 880. | de Freitas, Garruti, et al., 2011 | 30. m/0.25 mm/0.25 μm, Hydrogen; Program: 30 0C 3 0C/min -> 150 0C 20 0C/min -> 220 0C |
Capillary | Polydimethyl siloxane, 5 % phenyl | 864. | Skogerson, Wohlgemuth, et al., 2011 | Program: not specified |
Capillary | CP-Sil 8 CB | 886. | Di Giusto, Bessiere, et al., 2010 | 30. m/0.25 mm/0.25 μm, Helium; Program: Multi-rise program |
Capillary | DB-1-MS | 866. | Takeoka, Hobbs, et al., 2010 | 60. m/0.25 mm/0.25 μm, Helium; Program: not specified |
Capillary | HP-5 MS | 884. | Fan, Lu, et al., 2009 | 30. m/0.25 mm/0.25 μm, Helium; Program: 40 0C (3 min) 3 0C/min -> 160 0C (2 min) 8 0C/min -> 220 0C (3 min) |
Capillary | BPX-5 | 893. | se Souza, Cardeal, et al., 2009 | 30. m/0.25 mm/0.25 μm, Helium; Program: 35 0C (5 min) 3 0C/min -> 210 0C 40 0C/min -> 240 0C (10 min) |
Capillary | BPX-5 | 884. | se Souza, Cardeal, et al., 2009 | 30. m/0.25 mm/0.25 μm, Helium; Program: not specified |
Capillary | CP-Sil 5 Cb | 851. | Collin, Nizet, et al., 2008 | 50. m/0.32 mm/1.20 μm, Nitrogen; Program: 40 0C 20 0C/min -> 85 0C 1 0C/min -> 145 0C 3 0C/min -> 250 0C (30 min) |
Capillary | HP-5 | 876. | Zhao, Li, et al., 2008 | 30. m/0.25 mm/0.25 μm; Program: 40 0C (2 min) 5 0C/min -> 80 0C 7 oC/min -> 160 0C 9 0C/min -> 200 0C 20 0C/min -> 280 0C (10 min) |
Capillary | HP-5 | 875. | Zhao, Li, et al., 2008 | 30. m/0.25 mm/0.25 μm; Program: not specified |
Capillary | HP-1 | 852. | Barra, Baldovini, et al., 2007 | 50. m/0.2 mm/0.33 μm, He; Program: 40C(2min) => 2C/min => 200C => 15C/min => 250C (30min) |
Capillary | DB-5 | 876. | Beaulieu and Lancaster, 2007 | 30. m/0.25 mm/0.25 μm; Program: 50C(1min) => 5C/min => 100C => 10C/min => 250C (9min) |
Capillary | SPB-1 | 851. | Bosch-Fuste, Riu-Aumatell, et al., 2007 | 30. m/0.25 mm/0.25 μm, He; Program: 40C(10min) => 2C/min => 200C(1min) => 2C/min => 250C (10min) |
Capillary | VB-5 | 871. | Karlshøj, Nielsen, et al., 2007 | 60. m/0.25 mm/1. μm, He; Program: 35C(1min) => 4C/min => 175C => 10C/min => 260C |
Capillary | SE-54 | 878. | Lasekan, Buettner, et al., 2007 | 30. m/0.32 mm/0.25 μm; Program: 35C(2min) => 40C/min => 60C(2min) => 6C/min => 180C => 10C/min => 230C(10min) |
Capillary | SE-30 | 859. | Liu, Liang, et al., 2007 | Program: not specified |
Capillary | HP-5 | 867. | Splivallo, Bossi, et al., 2007 | He; Program: 50C => 3C/min => 200C(10min) => 10C/min => 290C(10min) |
Capillary | CP-Sil5 CB MS | 843. | Callemien, Dasnoy, et al., 2006 | 50. m/0.32 mm/1.2 μm, N2; Program: 36C => 20C/min => 85C => 1C/min => 145C => 3C/min => 250C(30min) |
Capillary | ZB-5 | 875. | Kubota T., Dorea H.S., et al., 2006 | Column length: 30. m; Program: not specified |
Capillary | SPB-1 | 860. | Riu-Aumatell, Bosch-Fuste´, et al., 2006 | 30. m/0.25 mm/0.25 μm; Program: not specified |
Capillary | SE-52 | 882. | Tognolini, Barocelli, et al., 2006 | 30. m/0.32 mm/0.15 μm, He; Program: 45C => 1C/min => 100C => 5C/min => 250C (10min) |
Capillary | DB-5 | 876. | Beaulieu, 2005 | 60. m/0.25 mm/0.25 μm; Program: 50C => 5C/min => 100C => 15C/min => 250C (19C) |
Capillary | CP-Sil 5 CB | 843. | Callamien, Dasnoy, et al., 2005 | 50. m/0.32 mm/1.2 μm, Nitrogen; Program: 36 0C 20 0C/min -> 85 0C 1 iC/min -> 145 0C 3 0C/min -> 250 0C |
Capillary | CP-Sil 5 CB | 843. | Callemien, Dasnoy, et al., 2005 | 50. m/0.32 mm/1.20 μm, Nitrogen; Program: 36 0C 20 0C/min -> 85 0C 1 0C/min -> 145 0C 3 0C/min -> 250 0C |
Capillary | Polydimethyl siloxane with 5 % Ph groups | 876. | Pino, Marbot, et al., 2005 | Program: not specified |
Capillary | SE-54 | 878. | Buettner, 2004 | 30. m/0.32 mm/0.25 μm, He; Program: 40C(2min) => 40C/min => 50C(2min) => 6C/min => 180C => 15C/min => 230C (10min) |
Capillary | CP Sil 5 CB | 853. | Counet, Ouwerx, et al., 2004 | 50. m/0.32 mm/1.2 μm; Program: 36C => 20C/min => 85C => 1C/min => 145C => 3C/min => 250C(30min) |
Capillary | 876. | El-Shazily, Hafez, et al., 2004 | Program: not specified | |
Capillary | MFE-73 | 860. | Escudero, Gogorza, et al., 2004 | Program: not specified |
Capillary | DB-5MS | 876. | Maia, Andrade, et al., 2004 | 30. m/0.25 mm/0.25 μm, He; Program: 40C => 2C/min => 60C => 4C/min => 260C |
Capillary | SE-30 | 860. | Vinogradov, 2004 | Program: not specified |
Capillary | DB-1 | 882. | Alves and Franco, 2003 | 30. m/0.25 mm/0.25 μm, H2; Program: 40C(10min) => 2C/min => 110C => 5C/min => 200C(10min) |
Capillary | HP-5 | 878. | Demyttenaere, Dagher, et al., 2003 | 30. m/0.25 mm/0.25 μm, He; Program: 40C(1min) => 5C/min => 180C => 10C/min => 220C(2min) |
Capillary | HP-5MS | 878. | Demyttenaere, Dagher, et al., 2002 | 30. m/0.25 mm/0.25 μm, He; Program: 40C(1min) => 5C/min => 220C => 10C/min => 240C(2min) |
Capillary | MFE-73 | 860. | Ferreira, Ortín, et al., 2002 | H2; Program: not specified |
Capillary | HP-5 | 880. | Jordán, Goodner, et al., 2002 | 30. m/0.25 mm/0.25 μm; Program: not specified |
Capillary | HP-5MS | 877. | Ansorena, Gimeno, et al., 2001 | 30. m/0.25 mm/0.25 μm, He; Program: 40C (10min) => 3C/min => 120C => 10C/min => 250C (5min) |
Capillary | CP Sil 5 CB | 849. | Lermusieau, Bulens, et al., 2001 | 50. m/0.32 mm/1.2 μm; Program: 36C => 20C/min => 120C(20min) => 2C/min => 250C(30min) |
Capillary | SPB-1 | 859. | Flanagan, Streete, et al., 1997 | 60. m/0.53 mm/5. μm, He; Program: 40C(6min) => 5C/min => 80C => 10C/min => 200C |
Capillary | DB-5 | 880. | Guth, 1997 | 30. m/0.32 mm/0.25 μm; Program: 35C (1min) => 40C/min => 60C (1min) => 6C/min => 250C (10min) |
Capillary | SE-54 | 880. | Guth, 1997 | 30. m/0.32 mm/0.25 μm; Program: 35C (1min) => 40C/min => 60C (1min) => 6C/min => 250C (10min) |
Capillary | DB-5 | 847. | Storer, Elmore, et al., 1993 | 30. m/0.32 mm/1. μm; Program: 0C(5min) => 60C/min => 60C (5min) => 4C/min => 250C (5min) |
Capillary | DB-5 | 854. | Storer, Elmore, et al., 1993 | 30. m/0.32 mm/1. μm; Program: 0C(5min) => 60C/min => 60C (5min) => 4C/min => 250C (5min) |
Capillary | SPB-1 | 859. | Strete, Ruprah, et al., 1992 | 60. m/0.53 mm/5.0 μm, Helium; Program: 40 0C (6 min) 5 0C/min -> 80 0C 10 0C/min -> 200 0C |
Capillary | SPB-1 | 884. | Strete, Ruprah, et al., 1992 | 60. m/0.53 mm/5.0 μm, Helium; Program: not specified |
Capillary | DB-1 | 855. | Takeoka, Flath, et al., 1988 | 30. m/0.25 mm/0.25 μm, H2; Program: 30C (2min) => 2C/min => 150C => 4C/min => 250C |
Capillary | DB-1 | 858. | Takeoka, Flath, et al., 1988 | 30. m/0.25 mm/0.25 μm, H2; Program: 30C (2min) => 2C/min => 150C => 4C/min => 250C |
Capillary | OV-1, SE-30, Methyl silicone, SP-2100, OV-101, DB-1, etc. | 853. | Waggott and Davies, 1984 | Hydrogen; Column length: 50. m; Column diameter: 0.32 mm; Program: not specified |

Normal alkane RI, polar column, isothermal

Column type | Active phase | Temperature (C) | I | Reference | Comment |
---|---|---|---|---|---|
Capillary | DB-Wax | 60. | 1114. | Shimadzu, 2003, 2 | 50. m/0.32 mm/1. μm, He |
Packed | Carbowax 20M | 100. | 1119. | Yabumoto, Jennings, et al., 1977 |

Normal alkane RI, polar column, temperature ramp

Column type | Active phase | I | Reference | Comment |
---|---|---|---|---|
Capillary | CP-Wax CB | 1122. | Alves, da Penha, et al., 2012 | 30. m/0.25 mm/0.25 μm, Helium, 2. K/min, 150. C @ 5. min; Tstart: 50. C |
Capillary | VF-Wax MS | 1125. | Duarte, Dias, et al., 2010 | 60. m/0.25 mm/0.25 μm, Helium, 60. C @ 5. min, 3. K/min, 220. C @ 25. min |
Capillary | DB-Wax | 1116. | Mallia, Escher, et al., 2009 | 30. m/0.32 mm/0.25 μm, Helium, 6. K/min, 240. C @ 5. min |
Capillary | CP-Wax 57 CB | 1112. | Callejon, Morales, et al., 2008 | 50. m/0.25 mm/0.20 μm, Hydrogen, 35. C @ 5. min, 4. K/min, 150. C @ 17.5 min |
Capillary | DB-Wax | 1140. | Caldeira, de Sousa, et al., 2008 | 30. m/0.25 mm/0.25 μm, Helium, 40. C @ 10. min, 3.5 K/min, 180. C @ 30. min |
Capillary | HP-Innowax | 1147. | Charoensiddhi and Anprung, 2008 | 30. m/0.25 mm/0.25 μm, Helium, 50. C @ 10. min, 15. K/min, 240. C @ 19. min |
Capillary | DB-Wax | 1111. | Kumazawa, Itobe, et al., 2008 | 30. m/0.25 mm/0.25 μm, He, 5. K/min; Tstart: 30. C; Tend: 210. C |
Capillary | DB-Wax | 1102. | Xu, Fan, et al., 2007 | 30. m/0.25 mm/0.25 μm, He, 40. C @ 2. min, 4. K/min, 230. C @ 5. min |
Capillary | DB-Wax | 1137. | Choi, 2006 | 60. m/0.25 mm/0.25 μm, N2, 70. C @ 2. min, 2. K/min, 230. C @ 20. min |
Capillary | DB-Wax | 1102. | Fan and Qian, 2006 | 30. m/0.32 mm/0.25 μm, He, 40. C @ 2. min, 4. K/min, 230. C @ 15. min |
Capillary | DB-Wax | 1124. | Fan and Qian, 2006, 2 | 30. m/0.32 mm/0.25 μm, N2, 40. C @ 2. min, 6. K/min, 230. C @ 15. min |
Capillary | DB-Wax | 1129. | Kishimoto, Wanikawa, et al., 2006 | 15. m/0.32 mm/0.25 μm, He, 6. K/min, 230. C @ 20. min; Tstart: 40. C |
Capillary | HP-Innowax | 1105. | Komes, Ulrich, et al., 2006 | 30. m/0.25 mm/0.5 μm, He, 40. C @ 3. min, 2. K/min, 200. C @ 15. min |
Capillary | DB-Wax | 1128. | Fan and Qian, 2005 | 30. m/0.32 mm/0.25 μm, N2, 40. C @ 2. min, 4. K/min, 230. C @ 5. min |
Capillary | HP-Innowax | 1103. | Isogai, Utsunomiya, et al., 2005 | 30. m/0.25 mm/0.25 μm, He, 40. C @ 5. min, 5. K/min, 240. C @ 15. min |
Capillary | DB-Wax | 1147. | Culleré, Escudero, et al., 2004 | 30. m/0.32 mm/0.5 μm, H2, 40. C @ 5. min, 4. K/min; Tend: 200. C |
Capillary | PEG-20M | 1110. | Narain, Almeida, et al., 2004 | 50. m/0.20 mm/0.20 μm, 40. C @ 5. min, 3. K/min, 180. C @ 30. min |
Capillary | DB-Wax | 1133. | Alves and Franco, 2003 | 30. m/0.25 mm/0.5 μm, H2, 50. C @ 10. min, 3. K/min, 200. C @ 10. min |
Capillary | DB-Wax | 1118. | Lee and Noble, 2003 | 30. m/0.25 mm/0.25 μm, He, 40. C @ 4. min, 4. K/min, 185. C @ 20. min |
Capillary | DB-Wax | 1134. | López, Ortín, et al., 2003 | 30. m/0.32 mm/0.5 μm, H2, 40. C @ 5. min, 4. K/min; Tend: 200. C |
Capillary | Supelcowax-10 | 1120. | Vichi, Castellote, et al., 2003 | 30. m/0.25 mm/0.25 μm, He, 40. C @ 10. min, 3. K/min; Tend: 200. C |
Capillary | Supelcowax-10 | 1118. | Vichi, Pizzale, et al., 2003 | 30. m/0.25 mm/0.25 μm, He, 40. C @ 10. min, 3. K/min; Tend: 200. C |
Capillary | DB-Wax | 1130. | Ferreira, Ortín, et al., 2002 | 30. m/0.32 mm/0.5 μm, H2, 40. C @ 5. min, 4. K/min; Tend: 200. C |
Capillary | FFAP | 1128. | Lecanu, Ducruet, et al., 2002 | 30. m/0.32 mm/1. μm, He, 35. C @ 3. min, 5. K/min; Tend: 240. C |
Capillary | DB-Wax | 1132. | Ferreira, Aznar, et al., 2001 | 30. m/0.32 mm/0.5 μm, H2, 40. C @ 5. min, 4. K/min, 200. C @ 60. min |
Capillary | DB-Wax | 1112. | Wei, Mura, et al., 2001 | 60. m/0.25 mm/0.25 μm, He, 2. K/min; Tstart: 40. C; Tend: 200. C |
Capillary | Supelcowax-10 | 1108. | Korány, Mednyánszky, et al., 2000 | 60. m/0.25 mm/0.25 μm, He, 4. K/min; Tstart: 60. C; Tend: 280. C |
Capillary | DB-Wax | 1143. | Kotseridis and Baumes, 2000 | 30. m/0.32 mm/0.5 μm, H2, 60. C @ 3. min, 3. K/min, 245. C @ 20. min |
Capillary | Carbowax 20M | 1128. | Lopez, Ferreira, et al., 1999 | 60. m/0.32 mm/0.5 μm, He, 40. C @ 5. min, 2. K/min; Tend: 190. C |
Capillary | Supelcowax-10 | 1142. | Campeanu, Burcea, et al., 1998 | 60. m/0.32 mm/0.5 μm, H2, 35. C @ 5. min, 5. K/min, 250. C @ 20. min |
Capillary | Carbowax 20M | 1128. | Ferreira, Ardanuy, et al., 1998 | 60. m/0.32 mm/0.5 μm, He, 40. C @ 5. min, 2. K/min; Tend: 190. C |
Capillary | Carbowax 20M | 1128. | Ferreira, Lopez, et al., 1998 | 60. m/0.32 mm/0.5 μm, He, 40. C @ 5. min, 2. K/min; Tend: 190. C |
Capillary | HP-Innowax | 1101. | Ong and Acree, 1998 | 4. K/min; Column length: 25. m; Column diameter: 0.32 mm; Tstart: 35. C; Tend: 250. C |
Capillary | HP-Innowax | 1101. | Ong, Acree, et al., 1998 | 4. K/min; Column length: 25. m; Column diameter: 0.32 mm; Tstart: 35. C; Tend: 250. C |
Capillary | DB-Wax | 1130. | Wada and Shibamoto, 1997 | He, 3. K/min, 200. C @ 40. min; Column length: 60. m; Column diameter: 0.25 mm; Tstart: 50. C |
Capillary | Supelcowax-10 | 1140. | Wong and Lai, 1996 | 60. m/0.25 mm/0.25 μm, He, 40. C @ 3. min, 3. K/min, 200. C @ 30. min |
Capillary | Carbowax 20M | 1110. | Egolf and Jurs, 1993 | 2. K/min; Column length: 80. m; Column diameter: 0.2 mm; Tstart: 70. C; Tend: 170. C |
Capillary | Carbowax 20M | 1110. | Anker, Jurs, et al., 1990 | 2. K/min; Column length: 80. m; Column diameter: 0.2 mm; Tstart: 70. C; Tend: 170. C |
Capillary | DB-Wax | 1118. | Takeoka and Butter, 1989 | 60. m/0.32 mm/0.25 μm, He, 30. C @ 4. min, 2. K/min; Tend: 180. C |
Capillary | DB-Wax | 1118. | Takeoka and Butter, 1989 | 60. m/0.32 mm/0.25 μm, He, 30. C @ 4. min, 2. K/min; Tend: 180. C |
Capillary | DB-Wax | 1122. | Takeoka, Flath, et al., 1988 | 60. m/0.25 mm/0.25 μm, H2, 30. C @ 2. min, 2. K/min; Tend: 180. C |
Capillary | DB-Wax | 1122. | Takeoka, Flath, et al., 1988 | 60. m/0.25 mm/0.25 μm, H2, 30. C @ 2. min, 2. K/min; Tend: 180. C |

Normal alkane RI, polar column, custom temperature program

Column type | Active phase | I | Reference | Comment |
---|---|---|---|---|
Capillary | FFAP-CB | 1114. | Collin, Nizet, et al., 2012, 2 | 25. m/0.32 mm/0.30 μm, Nitrogen; Program: 36 0C 20 0C/min -> 85 0C 1 0C/min -> 145 0C 3 0C/min -> 220 0C |
Capillary | Carbowax 20M | 1110. | Lee, Chong, et al., 2012 | Program: not specified |
Capillary | SOLGel-Wax | 1127. | Johanningsmeier and McFeeters, 2011 | 30. m/0.25 mm/0.25 μm, Helium; Program: 40 0C (2 min) 5 0C/min -> 140 0C 10 0C/min -> 250 0C (3 min) |
Capillary | SOLGel-Wax | 1127. | Johanningsmeier and McFeeters, 2011 | 30. m/0.25 mm/0.25 μm, Helium; Program: 40 0C (2 min) 5 0C/min -> 140 0C 10 0C/min -> 250 0C (3 min) |
Capillary | SOLGel-Wax | 1127. | Johanningsmeier and McFeeters, 2011 | 30. m/0.25 mm/0.25 μm, Helium; Program: not specified |
Capillary | DB-Wax | 1127. | Sampaio, Garruti, et al., 2011 | 30. m/0.25 mm/0.25 μm, Hydrogen; Program: 35 0C (9 min) 5 0C/min -> 80 0C 1 0C/min -> 100 0C 16 0C/min -> 210 0C (20 min) |
Capillary | HP-Innowax | 1129. | Xiao, Dai, et al., 2011 | 60. m/0.25 mm/0.25 μm, Helium; Program: 40 0C (2 min) 3 0C/min -> 150 0C 5 0C/min -> 220 0C (5 min) |
Capillary | DB-Wax | 1124. | San-Juan, Petka, et al., 2010 | 30. m/0.32 mm/0.50 μm, Hydrogen; Program: 40 0C (5 min) 4 0C/min -> 100 0C 6 0C/min -> 220 0C (20 min) |
Capillary | DB-Wax | 1124. | Ferreira, Juan, et al., 2009 | 30. m/0.32 mm/0.50 μm; Program: 40 0C (5 min) 4 0C/min -> 100 0C 6 0C/min -> 220 0C (40 min) |
Capillary | BP-20 | 1165. | Rodrigues, Caldera, et al., 2008 | 30. m/0.25 mm/0.25 μm, Helium; Program: 40 0C (1 min) 2 0C/min -> 100 0C (2 min) 1.7 0C/min -> 180 0C (1 min) 25 0C/min -> 220 0C (10 min) |
Capillary | BP-20 | 1166. | Rodrigues, Caldera, et al., 2008 | 30. m/0.25 mm/0.25 μm, Helium; Program: 40 0C (1 min) 2 0C/min -> 100 0C (2 min) 1.7 0C/min -> 180 0C (1 min) 25 0C/min -> 220 0C (10 min) |
Capillary | BP-20 | 1167. | Rodrigues, Caldera, et al., 2008 | 30. m/0.25 mm/0.25 μm, Helium; Program: 40 0C (1 min) 2 0C/min -> 100 0C (2 min) 1.7 0C/min -> 180 0C (1 min) 25 0C/min -> 220 0C (10 min) |
Capillary | DB-Wax | 1113. | Tao, Wenlai, et al., 2008 | 30. m/0.32 mm/0.25 μm, Helium; Program: 50 0C 20 0C/min -> 80 0C 3 0C/min -> 230 0C |
Capillary | DB-Wax | 1132. | Yongsheng, Hua, et al., 2008 | 30. m/0.32 mm/0.25 μm, Helium; Program: 40 0C (4 min) 3 0C/min -> 50 0C 5 0C/min -> 120 0C 7 0C/min -> 175 0C 10 0C/min -> 230 0C (8 min) |
Capillary | Supelcowax-10 | 1123. | Bosch-Fuste, Riu-Aumatell, et al., 2007 | 30. m/0.25 mm/0.25 μm, He; Program: 40C(10min) => 2C/min => 200C(1min) => 2C/min => 250C (10min) |
Capillary | DB-Wax | 1132. | Li, Tao, et al., 2007 | 30. m/0.32 mm/0.25 μm, He; Program: 40C(3min) => 4C/min => 160C => 7C/min => 230C (8min) |
Capillary | DB-Wax | 1135. | Selli, 2007 | 30. m/0.32 mm/0.50 μm, Hydrogen; Program: 60 0C (3 min) 2 0C/min -> 220 0C 3 0C/min -> 245 0C (20 min) |
Capillary | DB-Wax | 1122. | Tian, Zhang, et al., 2007 | 30. m/0.25 mm/0.25 μm, He; Program: 50 0C (2 min) 6 0C/min -> 150 0C 8 0C/min -> 230 0C (15 min) |
Capillary | HP-Innowax | 1098. | Weldegergis B.T., Tredoux A.G.J., et al., 2007 | 30. m/0.25 mm/0.5 μm, He; Program: 30C(2min) => 4C/min => 130C => 8C/min => 250C(5min) |
Capillary | Supelcowax-10 | 1116. | Riu-Aumatell, Bosch-Fuste´, et al., 2006 | 30. m/0.25 mm/0.25 μm; Program: not specified |
Capillary | Innowax FSC | 1136. | Baser, Özek, et al., 2004 | 60. m/0.25 mm/0.25 μm, He; Program: 60C(10min) => 4C/min => 220C(10min) => 1C/min => 240C |
Capillary | DB-FFAP | 1117. | Buettner, 2004 | 30. m/0.32 mm/0.25 μm, He; Program: 40C(2min) => 40C/min => 60C(2min) => 6C/min => 180C => 15C/min => 230C (10min) |
Capillary | DB-Wax | 1130. | Escudero, Gogorza, et al., 2004 | Program: not specified |
Capillary | BP-21 | 1125. | Salinas, Zalacain, et al., 2004 | 50. m/0.22 mm/0.25 μm, He; Program: 50C => 2.5C/min => 180C(2min) => 1C/min => 200C(10min) |
Capillary | Innowax | 1136. | Selli, Kürkçüoglu, et al., 2004 | 60. m/0.25 mm/0.25 μm, He; Program: 50C(10min) => 4C/min => 220C(10min) => 1C/min => 240C |
Capillary | Carbowax 20M | 1110. | Vinogradov, 2004 | Program: not specified |
Capillary | PEG-20M | 1111. | Garruti, Franco, et al., 2003 | 30. m/0.25 mm/0.25 μm; Program: 50C(8min) => 4C/min => 110C => 16C/min => 200C |
Capillary | DB-Wax | 1131. | Selli, Cabaroglu, et al., 2003 | 30. m/0.32 mm/0.5 μm, He; Program: 60C(2min) => 2C/min => 220C => 3C/min => 245C(20min) |
Capillary | CP-Wax 52CB | 1115. | Escalona, Birkmyre, et al., 2002 | 30. m/0.25 mm/0.25 μm, He; Program: 50C(5min) => 7C/min => 180C => 10C/min => 240C(10min) |
Capillary | Supelcowax-10 | 1132. | Rogerson and de Freitas, 2002 | 60. m/0.25 mm/0.25 μm, He; Program: 40C(20min) => (1.5C/min) => 200C => (10C/min) => 250C(120min) |
Capillary | TRWAX | 1143. | Torrens, 2002 | 60. m/0.25 mm/0.25 μm, He; Program: not specified |
Capillary | CP-Wax 52CB | 1121. | Escalona, Birkmyre, et al., 2001 | 30. m/0.25 mm/0.25 μm, He; Program: 50C(5min) => 7C/min => 180C => 10C/min => 240C(10min) |
Capillary | DB-Wax | 1110. | Miranda, Nogueira, et al., 2001 | 30. m/0.25 mm/0.25 μm, He; Program: 25 0C (0.5 min) 50 K/min -> 50 0C 3.5 K/min -> 150 0C 7.5 K/min -> 240 0C |
Capillary | Innowax FSC | 1136. | Tabanca N., Demirci F., et al., 2001 | 60. m/0.25 mm/0.25 μm, He; Program: 60C(10min) => 4C/min => 220C(10min) => 1C/min => 240C |
Capillary | PEG | 1126. | Vas, Gal, et al., 1998 | 40. m/0.182 mm/0.30 μm, Hydrogen; Program: 35 0C (5 min) 5 0C/min -> 100 0C 3 0C/min -> 200 0C (1 min) 20 0C/min -> 240 0C (2 min) |
Capillary | Carbowax 20M | 1100. | Vernin, Lageot, et al., 1998 | Program: not specified |
Capillary | DB-FFAP | 1114. | Guth, 1997 | 30. m/0.32 mm/0.25 μm; Program: 35C (1min) => 40C/min => 60C (1min) => 6C/min => 250C (10min) |
Capillary | DB-FFAP | 1114. | Guth, 1997 | 30. m/0.32 mm/0.25 μm; Program: 35C (1min) => 40C/min => 60C (1min) => 6C/min => 250C (10min) |
Capillary | CP-Wax 52 CB | 1168. | Carro Marino, López Tamames, et al., 1995 | H2; Column length: 30. m; Column diameter: 0.32 mm; Program: 60 0C 2 0C/min -> 220 0C 3 0C/min -> 245 0C |
Capillary | Supelcowax-10 | 1110. | Chang, Seitz, et al., 1995 | 30. m/0.32 mm/0.25 μm, He; Program: 50C(2min) => 7C/min => 140C => 17.5C/min => 230C |
Capillary | Carbowax 20M | 1115. | Peppard and Ramus, 1988 | He; Program: not specified |
Capillary | Polyethylene Glycol | 1110. | MacLeod and Pieris, 1981 | Program: not specified |

References

Quadri and Kudchadker, 1991
Quadri, S.K.; Kudchadker, A.P.,
Measurement of the critical temperatures and critical pressures of some thermally stable or mildly unstable esters, ketones, and ethers,
J. Chem. Thermodyn., 1991, 23, 129-34. [all data]
Brown, 1906
Brown, J.C.,
The critical temperature and value of ml/theta of some carbon compounds,
J. Chem. Soc., Trans., 1906, 89, 311. [all data]
Verevkin and Heintz, 1999
Verevkin, Sergey P.; Heintz, Andreas,
Determination of Vaporization Enthalpies of the Branched Esters from Correlation Gas Chromatography and Transpiration Methods,
J. Chem. Eng. Data, 1999, 44, 6, 1240-1244, https://doi.org/10.1021/je990122a
. [all data]
Aldrich Chemical Company Inc., 1990
Aldrich Chemical Company Inc.,
Catalog Handbook of Fine Chemicals, Aldrich Chemical Company, Inc., Milwaukee WI, 1990, 1. [all data]
Espinosa Diaz, Guetachew, et al., 1999
Espinosa Diaz, M.A.; Guetachew, T.; Landy, P.; Jose, J.; Voilley, A.,
Experimental and estimated saturated vapour pressures of aroma compounds,
Fluid Phase Equilibria, 1999, 157, 2, 257-270, https://doi.org/10.1016/S0378-3812(99)00016-3
. [all data]
Stephenson and Malanowski, 1987
Stephenson, Richard M.; Malanowski, Stanislaw,
Handbook of the Thermodynamics of Organic Compounds, 1987, https://doi.org/10.1007/978-94-009-3173-2
. [all data]
Terres, Brinkmann, et al., 1959
Terres, E.; Brinkmann, L.; Fischer, D.; Hüllstrung, D.; Loz, W.; Weisbrod, G.,
Brennst.-Chem., 1959, 40, 279. [all data]
Boublik, Fried, et al., 1984
Boublik, T.; Fried, V.; Hala, E.,
The Vapour Pressures of Pure Substances: Selected Values of the Temperature Dependence of the Vapour Pressures of Some Pure Substances in the Normal and Low Pressure Region, 2nd ed., Elsevier, New York, 1984, 972. [all data]
Usanovich and Dembitskii, 1959
Usanovich, M.; Dembitskii, A.,
Vapor Pressure of Systems of Tin Chloride with Ethers,
Zh. Obshch. Khim., 1959, 29, 1771-1781. [all data]
Field, 1969
Field, F.H.,
Chemical Ionization Mass Spectrometry. IX. Temperature and Pressure Studies with Benzyl Acetate and t-Amyl Acetate,
J. Am. Chem. Soc., 1969, 91, 11, 2827, https://doi.org/10.1021/ja01039a002
. [all data]
Garay, 2000
Garay, F.,
Application of a flow-tunable, serially coupled gas chromatographic capillary column system for the analysis of complex mixtures,
Chromatographia Sup., 2000, 51, 1, s108-s120, https://doi.org/10.1007/BF02492792
. [all data]
Tudor and Moldovan, 1999
Tudor, E.; Moldovan, D.,
Temperature Dependence of the Retention Index for Perfumery Compounds on a Se-30 Glass Capillary Column. II. The Hyperbolic Equation,
J. Chromatogr., 1999, 848, 1-2, 215-227, https://doi.org/10.1016/S0021-9673(99)00412-4
. [all data]
Tudor, 1997
Tudor, E.,
Temperature dependence of the retention index for perfumery compounds on a SE-30 glass capillary column. I. Linear equations,
J. Chromatogr. A, 1997, 779, 1-2, 287-297, https://doi.org/10.1016/S0021-9673(97)00453-6
. [all data]
Castello, Vezzani, et al., 1991
Castello, G.; Vezzani, S.; Gerbino, T.,
Gas chromatographic separation and automatic identification of complex mixtures of organic solvents in indrustrial wates,
J. Chromatogr., 1991, 585, 2, 273-280, https://doi.org/10.1016/0021-9673(91)85088-W
. [all data]
Komárek, Hornová, et al., 1982
Komárek, K.; Hornová, L.; Churácek, J.,
Glass capillary gas chromatography of homologous series of esters. Separation of homologous series of esters of halogenated carboxylic acids on a glass capillary column with the non-polar stationary silicone phase OV-101,
J. Chromatogr., 1982, 244, 1, 142-147, https://doi.org/10.1016/S0021-9673(00)80131-4
. [all data]
Ashes and Haken, 1974
Ashes, J.R.; Haken, J.K.,
Gas chromatography of homologous esters. VI. Structure-retention increments of aliphatic esters,
J. Chromatogr., 1974, 101, 1, 103-123, https://doi.org/10.1016/S0021-9673(01)94737-5
. [all data]
Zarazir, Chovin, et al., 1970
Zarazir, D.; Chovin, P.; Guiochon, G.,
Identification of hydroxylic compounds and their derivatives by gas chromatography,
Chromatographia, 1970, 3, 4, 180-195, https://doi.org/10.1007/BF02269018
. [all data]
Germaine and Haken, 1969
Germaine, R.W.; Haken, J.K.,
Gas chromatography of homologous esters. Part 1. Simple aliphatic esters,
J. Chromatogr., 1969, 43, 33-42, https://doi.org/10.1016/S0021-9673(00)99162-3
. [all data]
Srivastava, Ahmad, et al., 2003
Srivastava, S.K.; Ahmad, A.; Syamsunder, K.V.; Aggarwal, K.K.; Shanuja, S.P.S.,
Essential oil composition of Callistemon viminalis leaves from India,
Flavour Fragr. J., 2003, 18, 5, 361-363, https://doi.org/10.1002/ffj.1143
. [all data]
Raina, Lal, et al., 2002
Raina, V.K.; Lal, R.K.; Tripathi, S.; Khan, M.; Syamasundar, K.V.; Srivastava, S.K.,
Erratum. Essential oil composition of genetically diverse stocks of Murraya koenigii from India,
Flavour Fragr. J., 2002, 17, 5, 404, https://doi.org/10.1002/ffj.1139
. [all data]
Takeoka, Buttery, et al., 1992
Takeoka, G.R.; Buttery, R.G.; Flath, R.A.,
Volatile constituents of Asian pear (Pyrus serotina),
J. Agric. Food Chem., 1992, 40, 10, 1925-1929, https://doi.org/10.1021/jf00022a040
. [all data]
Rasmussen, 1983
Rasmussen, P.,
Identification of Volatile Components of Jacjfruit by Gas Chromatography / MAss Spectrometry with Two Different Columns,
Anal. Chem., 1983, 55, 8, 1331-1335, https://doi.org/10.1021/ac00259a033
. [all data]
Chretien and Dubois, 1978
Chretien, J.R.; Dubois, J-E.,
Topological Analysis: A Technique for the Physico-Chemical Exploitation of Retention Data in Gas-Liquid Chromatography,
J. Chromatogr., 1978, 158, 43-56, https://doi.org/10.1016/S0021-9673(00)89954-9
. [all data]
Kevei and Kozma, 1976
Kevei, E.; Kozma, E.,
Gaschromatographische Untersuchungsmethoden zur Aromaprüfung in gekochtem Schweinefleisch (M. semimembranosus),
Nahrung, 1976, 20, 3, 243-252, https://doi.org/10.1002/food.19760200303
. [all data]
Shimadzu, 2003
Shimadzu,
Gas chromatography analysis of organic solvents using capillary columns (No. 2), 2003, retrieved from http://www.shimadzu.com/apps/form.cfm. [all data]
Tatsuka, Suekane, et al., 1990
Tatsuka, K.; Suekane, S.; Sakai, Y.; Sumitani, H.,
Volatile constituents of kiwi fruit flowers: simultaneous distillation and extraction versus headspace sampling,
J. Agric. Food Chem., 1990, 38, 12, 2176-2180, https://doi.org/10.1021/jf00102a015
. [all data]
Umano, Shoji, et al., 1986
Umano, K.; Shoji, A.; Hagi, Y.; Shibamoto, T.,
Volatile constituents of peel of quince fruit, Cydonia oblonga Miller,
J. Agric. Food Chem., 1986, 34, 4, 593-596, https://doi.org/10.1021/jf00070a003
. [all data]
Buttery, Seifert, et al., 1982
Buttery, R.G.; Seifert, R.M.; Ling, L.C.; Soderstrom, E.L.; Ogawa, J.M.; Turnbaugh, J.G.,
Additional aroma components of honeydew melon,
J. Agric. Food Chem., 1982, 30, 6, 1208-1211, https://doi.org/10.1021/jf00114a051
. [all data]
Toda, Yamaguchi, et al., 1982
Toda, H.; Yamaguchi, K.; Shibamoto, T.,
Isolation and identification of banana-like aroma from banana shrub (Michellia figo Spreng),
J. Agric. Food Chem., 1982, 30, 1, 81-84, https://doi.org/10.1021/jf00109a017
. [all data]
Spencer, Pangborn, et al., 1978
Spencer, M.D.; Pangborn, R.M.; Jennings, W.G.,
Gas chromatographic and sensory analysis of volatiles from cling peaches,
J. Agric. Food Chem., 1978, 26, 3, 725-732, https://doi.org/10.1021/jf60217a052
. [all data]
Tressl, Friese, et al., 1978
Tressl, R.; Friese, L.; Fendesack, F.; Köppler, H.,
Gas chromatographic--mass spectrometric investigation of hop aroma constituents in beer,
J. Agric. Food Chem., 1978, 26, 6, 1422-1426, https://doi.org/10.1021/jf60220a037
. [all data]
Garruti, Franco, et al., 2001
Garruti, D.S.; Franco, M.R.B.; da Silva, M.A.A.A.P.; Janzantti, N.S.; Alves, G.L.,
Compostos voláteis do sabor de pseudofrutos de cajueiro anão precoce (Anacardium occidentale L.) CCP-76, Boletim de Pesquisa e Desenvolvimento 4, Empresa Brasileira de Pesquisa Agropecuária, Fortaleza, Brazil, 2001, 29, retrieved from http://www.cnpat.embrapa.br/publica/pub/BolPesq/pd4.pdf. [all data]
Brander, Kepner, et al., 1980
Brander, C.F.; Kepner, R.E.; Webb, A.D.,
Identification of Some Volatile Compounds of Wine of Vitis Vinifera Cultivar Pinot Noir,
Am. J. Enol. Vitic, 1980, 31, 1, 69-75. [all data]
Zaikin, 2010
Zaikin, V.G.,
Personal communication: Retention indices measured during 2010, 2010. [all data]
Mahattanatawee K., Perez-Cacho P.R., et al., 2007
Mahattanatawee K.; Perez-Cacho P.R.; Davenport T.; Rouseff R.,
Comparison of three lychee cultivar odor profiles using gas chromatography-olfactometry and gas chromatography-sulfur detection,
J. Agric. Food Chem., 2007, 55, 5, 1939-1944, https://doi.org/10.1021/jf062925p
. [all data]
Quijano, Salamanca, et al., 2007
Quijano, C.E.; Salamanca, G.; Pino, J.A.,
Aroma volatile constituents of Colombian varieties of mango (Mangifera indica L.),
Flavour Fragr. J., 2007, 22, 5, 401-406, https://doi.org/10.1002/ffj.1812
. [all data]
Fang and Qian, 2005
Fang, Y.; Qian, M.,
Aroma compounds in Oregon Pinot Noir wine determined by aroma extract dilution analysis (AEDA),
Flavour Fragr. J., 2005, 20, 1, 22-29, https://doi.org/10.1002/ffj.1551
. [all data]
Pino, Mesa, et al., 2005
Pino, J.A.; Mesa, J.; Muñoz, Y.; Martí, M.P.; Marbot, R.,
Volatile components from mango (Mangifera indica L.) cultivars,
J. Agric. Food Chem., 2005, 53, 6, 2213-2223, https://doi.org/10.1021/jf0402633
. [all data]
Hierro, de la Hoz, et al., 2004
Hierro, E.; de la Hoz, L.; Ordóñez, J.A.,
Headspace volatile compounds from salted and occasionally smoked dried meats (cecinas) as affected by animal species,
Food Chem., 2004, 85, 4, 649-657, https://doi.org/10.1016/j.foodchem.2003.07.001
. [all data]
Pino, Marbot, et al., 2004
Pino, J.A.; Marbot, R.; Rosado, A.; Vázquez, C.,
Volatile constituents of Malay rose apple [Syzygium malaccense (L.) Merr. Perry],
Flavour Fragr. J., 2004, 19, 1, 32-35, https://doi.org/10.1002/ffj.1269
. [all data]
Rodríguez-Burruezo, Kollmannsberger, et al., 2004
Rodríguez-Burruezo, A.; Kollmannsberger, H.; Prohens, J.; Nitz, S.; Nuez, F.,
Analysis of the volatile aroma constituents of parental and hybrid clones of pepino (Solanum muricatum),
J. Agric. Food Chem., 2004, 52, 18, 5663-5669, https://doi.org/10.1021/jf040107w
. [all data]
Bader, Flamini, et al., 2003
Bader, A.; Flamini, G.; Cioni, P.L.; Morelli, I.,
Essential oil composition of Achillea santolina L. and Achillea biebersteinii Afan. collected in Jordan,
Flavour Fragr. J., 2003, 18, 1, 36-38, https://doi.org/10.1002/ffj.1147
. [all data]
Ceva-Antunes, Bizzo, et al., 2003
Ceva-Antunes, P.M.N.; Bizzo, H.R.; Alves, S.M.; Antunes, O.A.C.,
Analysis of volatile compounds of taperebá (Spondias mombin L.) and Cajá (Spondias mombin L.) by simultaneous distillation and extraction (SDE) and solid phase microextraction (SPME),
J. Agric. Food Chem., 2003, 51, 5, 1387-1392, https://doi.org/10.1021/jf025873m
. [all data]
Pino, Marbot, et al., 2003
Pino, J.; Marbot, R.; Rosado, A.; Vázquez, C.,
Volatile constituents of fruits of Garcinia dulcis Kurz. from Cuba,
Flavour Fragr. J., 2003, 18, 4, 271-274, https://doi.org/10.1002/ffj.1187
. [all data]
Sun and Stremple, 2003
Sun, G.; Stremple, P.,
Retention index characterization of flavor, fragrance, and many other compounds on DB-1 and DB-XLB, 2003, retrieved from http://www.chem.agilent.com/cag/cabu/pdf/b-0279.pdf. [all data]
Pino, Marbot, et al., 2002
Pino, J.A.; Marbot, R.; Quert, R.; García, H.,
Study of essential oils of Eucalyptus resinifera Smith, E. tereticornis Smith and Corymbia maculata (Hook.) K.D. Hill L.A.S. Johnson, grown in Cuba,
Flavour Fragr. J., 2002, 17, 1, 1-4, https://doi.org/10.1002/ffj.1026
. [all data]
Pino, Marbot, et al., 2002, 2
Pino, J.; Marbot, R.; Rosado, A.,
Volatile constituents of star apple (Chrysophyllum cainito L.) from Cuba,
Flavour Fragr. J., 2002, 17, 5, 401-403, https://doi.org/10.1002/ffj.1116
. [all data]
Isidorov, Zenkevich, et al., 2001
Isidorov, V.A.; Zenkevich, I.G.; Krajewska, U.; Dubis, E.N.; Jaroszynska, J.; Bal, K.,
Gas chromatographic analysis of essential oils with preliminary partition of components,
Phytochem. Anal., 2001, 12, 2, 87-90, https://doi.org/10.1002/pca.564
. [all data]
Larráyoz, Addis, et al., 2001
Larráyoz, P.; Addis, M.; Gauch, R.; Bosset, J.O.,
Comparison of dynamic headspace and simultaneous distillation extraction techniques used for the analysis of the volatile components in three European PDO ewes milk cheeses,
Int. Dairy J., 2001, 11, 11-12, 911-926, https://doi.org/10.1016/S0958-6946(01)00144-3
. [all data]
Pino, Marbot, et al., 2001
Pino, J.A.; Marbot, R.; Vázquez, C.,
Characterization of volatiles in strawberry guava (Psidium cattleianum Sabine) fruit,
J. Agric. Food Chem., 2001, 49, 12, 5883-5887, https://doi.org/10.1021/jf010414r
. [all data]
Shalit, Katzir, et al., 2001
Shalit, M.; Katzir, N.; Tadmor, Y.; Larkov, O.; Burger, Y.; Shalekhet, F.; Lastochkin, E.; Ravid, U.; Amar, O.; Edelstein, M.; Karchi, Z.; Lewinsohn, E.,
Acetyl-CoA: alcohol acetyltransferase activity and aroma formation in ripening melon fruits,
J. Agric. Food Chem., 2001, 49, 2, 794-799, https://doi.org/10.1021/jf001075p
. [all data]
Moio, Piombino, et al., 2000
Moio, L.; Piombino, P.; Addeo, F.,
Odour-impact compounds of Gorgonzola cheese,
J. Dairy Res., 2000, 67, 2, 273-285, https://doi.org/10.1017/S0022029900004106
. [all data]
Yassaa, Meklati, et al., 2000
Yassaa, N.; Meklati, B.Y.; Cecinato, A.,
Evaluation of monoterpenic biogenic volatile organic compounds in ambient air around Eucalyptus globulus, Pinus halepensis and Cedrus atlantica trees growing in Algiers city area by chiral and achiral capillary gas chromatography,
Atmos. Environ., 2000, 34, 17, 2809-2816, https://doi.org/10.1016/S1352-2310(99)00436-7
. [all data]
Aaslyng, Elmore, et al., 1998
Aaslyng, M.D.; Elmore, J.S.; Mottram, D.S.,
Comparison of the aroma characteristics of acid-hydrolyzed and enzyme-hydrolyzed vegetable proteins produced from soy,
J. Agric. Food Chem., 1998, 46, 12, 5225-5231, https://doi.org/10.1021/jf9806816
. [all data]
Komárek, Richter, et al., 1998
Komárek, K.; Richter, P.; Hoffmann, J.,
Capillary gas chromatography of n-butyl and isobutyl-, n-amyl and isoamyl polyethylene glycol ethers and their derivatives,
J. Chromatogr. A, 1998, 800, 2, 305-315, https://doi.org/10.1016/S0021-9673(97)01144-8
. [all data]
Moio and Addeo, 1998
Moio, L.; Addeo, F.,
Grana Padano cheese aroma,
J. Dairy Res., 1998, 65, 2, 317-333, https://doi.org/10.1017/S0022029997002768
. [all data]
Bartelt, 1997
Bartelt, R.J.,
Calibration of a commercial solid-phase microextraction device for measuring headspace concentrations of organic volatiles,
Anal. Chem., 1997, 69, 3, 364-372, https://doi.org/10.1021/ac960820n
. [all data]
Lee, DeMilo, et al., 1997
Lee, C.-J.; DeMilo, A.B.; Moreno, D.S.; Mangan, R.L.,
Identification of the volatile components of E802 Mazoferm steepwater, a condensed fermented corn extractive highly attractive to the Mexican fruit fly (Diptera: Tephritidae),
J. Agric. Food Chem., 1997, 45, 6, 2327-2331, https://doi.org/10.1021/jf960632y
. [all data]
DeMilo, Lee, et al., 1996
DeMilo, A.B.; Lee, C.-J.; Moreno, D.S.; Martinez, A.J.,
Identification of volatiles derived from Citrobacter freundii fermentation of a trypticase soy broth,
J. Agric. Food Chem., 1996, 44, 2, 607-612, https://doi.org/10.1021/jf950525o
. [all data]
Chisholm, Guiher, et al., 1994
Chisholm, M.G.; Guiher, L.A.; Vonah, T.M.; Beaumont, J.L.,
Comparison of some French-American hybrid wines with white Riesling using gas chromatography-olfactometry,
Am. J. Enol. Vitic, 1994, 45, 2, 201-212. [all data]
Guichard and Souty, 1988
Guichard, E.; Souty, M.,
Comparison of the relative quantities of aroma compounds found in fresh apricot (Prunus armeniaca) from six different varieties,
Z. Lebensm. Unters. Forsch., 1988, 186, 4, 301-307, https://doi.org/10.1007/BF01027031
. [all data]
Korhonen, 1984
Korhonen, I.O.O.,
Gas-Liquid Chromatographic Analyses. XXV. Branched-Chain C3-C5 Alkyl Esters of Halogenated Acetic Acids,
J. Chromatogr., 1984, 288, 51-69, https://doi.org/10.1016/S0021-9673(01)93681-7
. [all data]
de Pooter, Montens, et al., 1983
de Pooter, H.L.; Montens, J.P.; Willaert, G.A.; Dirinck, P.J.; Schamp, N.M.,
Treatment of golden delicious apples with aldehydes and carboxylic acids: effect on the headspace composition,
J. Agric. Food Chem., 1983, 31, 4, 813-818, https://doi.org/10.1021/jf00118a034
. [all data]
van den Dool and Kratz, 1963
van den Dool, H.; Kratz, P. Dec.,
A generalization of the retention index system including linear temperature programmed gas-liquid partition chromatography,
J. Chromatogr., 1963, 11, 463-471, https://doi.org/10.1016/S0021-9673(01)80947-X
. [all data]
Tret'yakov, 2008
Tret'yakov, K.V.,
Retention Data. NIST Mass Spectrometry Data Center., NIST Mass Spectrometry Data Center, 2008. [all data]
Sampaio and Nogueira, 2006
Sampaio, T.S.; Nogueira, P.C.L.,
Volatile components of mangaba fruit (Hancornia speciosa Gomes) at three stages of maturity,
Food Chem., 2006, 95, 4, 606-610, https://doi.org/10.1016/j.foodchem.2005.01.038
. [all data]
Bonaiti, Irlinger, et al., 2005
Bonaiti, C.; Irlinger, F.; Spinnler, H.E.; Engel, E.,
An iterative sensory procedure to select odor-active associations in complex consortia of microorganisms: application to the construction of a cheese model,
J. Dairy Sci., 2005, 88, 5, 1671-1684, https://doi.org/10.3168/jds.S0022-0302(05)72839-3
. [all data]
Campo, Ferreira, et al., 2005
Campo, E.; Ferreira, V.; Escudero, A.; Cacho, J.,
Prediction of the wine sensory properties related to grape variety from dynamic-headspace gas chromatography-olfactometry data,
J. Agric. Food Chem., 2005, 53, 14, 5682-5690, https://doi.org/10.1021/jf047870a
. [all data]
Boscaini, van Ruth, et al., 2003
Boscaini, E.; van Ruth, S.; Biasioli, F.; Gasperi, F.; Märk, T.D.,
Gas chromatography-olfactometry (GC-O) and proton transfer reaction-mass spectrometry (PTR-MS) analysis of the flavor profile of grana padano, parmigiano reggiano, and grana trentino cheeses,
J. Agric. Food Chem., 2003, 51, 7, 1782-1790, https://doi.org/10.1021/jf020922g
. [all data]
Mayr, van Ruth, et al., 2003
Mayr, D.; van Ruth, S.; Märk, T.D.,
Evaluation of the influence of mastication on temporal aroma release of ripe and unripe bananas, using a model mouth system and gas chromatography-olfactometry,
Eur. Food Res. Technol., 2003, 217, 4, 291-295, https://doi.org/10.1007/s00217-003-0777-1
. [all data]
Kirchhoff and Schieberle, 2002
Kirchhoff, E.; Schieberle, P.,
Quantitation of odor-active compounds in rye flour and rye sourdough using stable isotope dilution assays,
J. Agric. Food Chem., 2002, 50, 19, 5378-5385, https://doi.org/10.1021/jf020236h
. [all data]
Beaulieu and Grimm, 2001
Beaulieu, J.C.; Grimm, C.C.,
Identification of volatile compounds in cantaloupe at various developmental stages using solid phase microextraction,
J. Agric. Food Chem., 2001, 49, 3, 1345-1352, https://doi.org/10.1021/jf0005768
. [all data]
Boulanger and Crouzet, 2001
Boulanger, R.; Crouzet, J.,
Identification of the aroma components of acerola (Malphigia glabra L.): free and bound flavor compounds,
Food Chem., 2001, 74, 2, 209-216, https://doi.org/10.1016/S0308-8146(01)00128-5
. [all data]
Isidorov, Krajewska, et al., 2001
Isidorov, V.A.; Krajewska, U.; Dubis, E.N.; Jdanova, M.A.,
Partition coefficients of alkyl aromatic hydrocarbons and esters in a hexane-acetonitrile system,
J. Chromatogr. A, 2001, 923, 1-2, 127-136, https://doi.org/10.1016/S0021-9673(01)00929-3
. [all data]
Eri, Khoo, et al., 2000
Eri, S.; Khoo, B.K.; Lech, J.; Hartman, T.G.,
Direct thermal desorption-gas chromatography and gas chromatography-mass spectrometry profiling of hop (Humulus lupulus L.) essential oils in support of varietal characterization,
J. Agric. Food Chem., 2000, 48, 4, 1140-1149, https://doi.org/10.1021/jf9911850
. [all data]
Fickert and Schieberle, 1998
Fickert, B.; Schieberle, P.,
Identification of the key odorants in barley malt (caramalt) using GC/MS techniques and odour dilution analyses,
Nahrung, 1998, 42, 6, 371-375, https://doi.org/10.1002/(SICI)1521-3803(199812)42:06<371::AID-FOOD371>3.0.CO;2-V
. [all data]
Mondello, Dugo, et al., 1995
Mondello, L.; Dugo, P.; Basile, A.; Dugo, G.,
Interactive use of linear retention indices, on polar and apolar columns, with a MS-library for reliable identification of complex mixtures,
J. Microcolumn Sep., 1995, 7, 6, 581-591, https://doi.org/10.1002/mcs.1220070605
. [all data]
Aubert and Chanforan, 2007
Aubert, C.; Chanforan, C.,
Postharvest Changes in Physicochemical Properties and Volatile Constituents of Apricot (Prunus armeniaca L.). Characterization of 28 Cultivars,
J. Agric. Food Chem., 2007, 55, 8, 3074-3082, https://doi.org/10.1021/jf063476w
. [all data]
Botelho, Caldeira, et al., 2007
Botelho, G.; Caldeira, I.; Mendes-Faia, A.; Clímaco, M.C.,
Evaluation of two quantitative gas chromatography-olfactometry methods for clonal red wines differentiation,
Flavour Fragr. J., 2007, 22, 5, 414-420, https://doi.org/10.1002/ffj.1815
. [all data]
Aubert C. and Pitrat M., 2006
Aubert C.; Pitrat M.,
Volatile compounds in the skin and pulp of Queen Anne's pocket melon,
J. Agric. Food Chem., 2006, 54, 21, 8177-8182, https://doi.org/10.1021/jf061415s
. [all data]
Gurbuz O., Rouseff J.M., et al., 2006
Gurbuz O.; Rouseff J.M.; Rouseff R.L.,
Comparison of aroma volatiles in commercial Merlot and Cabernet Sauvignon wines using gas chromatography - Olfactometry and gas chromatography - Mass spectrometry,
J. Agric. Food Chem., 2006, 54, 11, 3990-3996, https://doi.org/10.1021/jf053278p
. [all data]
Osorio, Alarcon, et al., 2006
Osorio, C.; Alarcon, M.; Moreno, C.; Bonilla, A.; Barrios, J.; Garzon, C.; Duque, C.,
Characterization of Odor-Active Volatiles in Champa ( Campomanesia lineatifolia R. P.),
J. Agric. Food Chem., 2006, 54, 2, 509-516, https://doi.org/10.1021/jf052098c
. [all data]
Petka, Ferreira, et al., 2006
Petka, J.; Ferreira, V.; González-Viñas, M.A.; Cacho, J.,
Sensory and Chemical Characterization of the Aroma of a White Wine Made with Devín Grapes,
J. Agric. Food Chem., 2006, 54, 3, 909-915, https://doi.org/10.1021/jf0518397
. [all data]
Pena, Barciela, et al., 2005
Pena, R.M.; Barciela, J.; Herrero, C.; Garcia-Martin, S.,
Optimization of solid-phase microextraction methods for GC-MS determination of terpenes in wine,
J. Sci. Food Agric., 2005, 85, 7, 1227-1234, https://doi.org/10.1002/jsfa.2121
. [all data]
Riu-Aumatell, Lopez-Tamames, et al., 2005
Riu-Aumatell, M.; Lopez-Tamames, E.; Buxaderas, S.,
Assessment of the Volatile Composition of Juices of Apricot, Peach, and Pear According to Two Pectolytic Treatments,
J. Agric. Food Chem., 2005, 53, 20, 7837-7843, https://doi.org/10.1021/jf051397z
. [all data]
Ferrari, Lablanquie, et al., 2004
Ferrari, G.; Lablanquie, O.; Cantagrel, R.; Ledauphin, J.; Payot, T.; Fournier, N.; Guichard, E.,
Determination of key odorant compounds in freshly distilled cognac using GC-O, GC-MS, and sensory evaluation,
J. Agric. Food Chem., 2004, 52, 18, 5670-5676, https://doi.org/10.1021/jf049512d
. [all data]
Ledauphin, Saint-Clair, et al., 2004
Ledauphin, J.; Saint-Clair, J.-F.; Lablanquie, O.; Guichard, H.; Founier, N.; Guichard, E.; Barillier, D.,
Identification of trace volatile compounds in freshly distilled calvados and cognac using preparative separations coupled with gas chromatography-mass spectrometry,
J. Agric. Food Chem., 2004, 52, 16, 5124-5134, https://doi.org/10.1021/jf040052y
. [all data]
Ménager, Jost, et al., 2004
Ménager, I.; Jost, M.; Aubert, C.,
Changes in physicochemical characteristics and volatile constituents of strawberry (Cv. Cigaline) during maturation,
J. Agric. Food Chem., 2004, 52, 5, 1248-1254, https://doi.org/10.1021/jf0350919
. [all data]
Varming, Petersen, et al., 2004
Varming, C.; Petersen, M.A.; Poll, L.,
Comparison of isolation methods for the determination of important aroma compounds in black currant (Ribes nigrum L.) juice, using nasal impact frequency profiling,
J. Agric. Food Chem., 2004, 52, 6, 1647-1652, https://doi.org/10.1021/jf035133t
. [all data]
Charles, Martin, et al., 2000
Charles, M.; Martin, B.; Ginies, C.; Etievant, P.; Coste, G.; Guichard, E.,
Potent aroma compounds of two red wine vinegars,
J. Agric. Food Chem., 2000, 48, 1, 70-77, https://doi.org/10.1021/jf9905424
. [all data]
Chung, 2000
Chung, H.Y.,
Volatile flavor components in red fermented soybean (Glycine max) curds,
J. Agric. Food Chem., 2000, 48, 5, 1803-1809, https://doi.org/10.1021/jf991272s
. [all data]
Chung, 1999
Chung, H.Y.,
Volatile components in fermented soybean (Glycine max) curds,
J. Agric. Food Chem., 1999, 47, 7, 2690-2696, https://doi.org/10.1021/jf981166a
. [all data]
Chyau, Mau, et al., 1996
Chyau, C.-C.; Mau, J.-L.; Wu, C.-M.,
Characteristics of the steam-distilled oil and carbon dioxide extract of Zanthoxylum simulans and fruits,
J. Agric. Food Chem., 1996, 44, 4, 1096-1099, https://doi.org/10.1021/jf950577d
. [all data]
Sumitani, Suekane, et al., 1994
Sumitani, H.; Suekane, S.; Nakatani, A.; Tatsuka, K.,
Changes in composition of volatile compounds in high pressure treated peach,
J. Agric. Food Chem., 1994, 42, 3, 785-790, https://doi.org/10.1021/jf00039a037
. [all data]
Stashenko, Macku, et al., 1992
Stashenko, H.; Macku, C.; Shibamato, T.,
Monitoring volatile chemicals formed from must during yeast fermentation,
J. Agric. Food Chem., 1992, 40, 11, 2257-2259, https://doi.org/10.1021/jf00023a040
. [all data]
Umano, Hagi, et al., 1992
Umano, K.; Hagi, Y.; Nakahara, K.; Shoji, A.; Shibamoto, T.,
Volatile constituents of green and ripened pineapple (Aanas comosus [L.] Merr.),
J. Agric. Food Chem., 1992, 40, 4, 599-603, https://doi.org/10.1021/jf00016a014
. [all data]
Suárez and Duque, 1991
Suárez, M.; Duque, C.,
Volatile constituents of lulo (Salanum vestissimum D.) fruit,
J. Agric. Food Chem., 1991, 39, 8, 1498-1500, https://doi.org/10.1021/jf00008a026
. [all data]
Fröhlich, Duque, et al., 1989
Fröhlich, O.; Duque, C.; Schreier, P.,
Volatile constituents of curuba (Passiflora mollissima) fruit,
J. Agric. Food Chem., 1989, 37, 2, 421-425, https://doi.org/10.1021/jf00086a033
. [all data]
Bianchi, Cantoni, et al., 2007
Bianchi, F.; Cantoni, C.; Careri, M.; Chiesa, L.; Musci, M.; Pinna, A.,
Characterization of the aromatic profile for the authentication and differentiation of typical Italian dry-sausages,
Talanta, 2007, 72, 4, 1552-1563, https://doi.org/10.1016/j.talanta.2007.02.019
. [all data]
Bianchi, Careri, et al., 2007
Bianchi, F.; Careri, M.; Mangia, A.; Musci, M.,
Retention indices in the analysis of food aroma volatile compounds in temperature-programmed gas chromatography: Database creation and evaluation of precision and robustness,
J. Sep. Sci., 2007, 39, 4, 563-572, https://doi.org/10.1002/jssc.200600393
. [all data]
Escudero, Campo, et al., 2007
Escudero, A.; Campo, E.; Fariña, L.; Cacho, J.; Ferreira, V.,
Analytical Characterization of the Aroma of Five Premium Red Wines. Insights into the Role of Odor Families and the Concept of Fruitiness of Wines,
J. Agric. Food Chem., 2007, 55, 11, 4501-4510, https://doi.org/10.1021/jf0636418
. [all data]
Selli, Canbas, et al., 2006
Selli, S.; Canbas, A.; Cabaroglu, T.; Erten, H.; Gunata, Z.,
Aroma components of cv. Muscat of Bornova wines and influence of skin contact treatment,
Food Chem., 2006, 94, 3, 319-326, https://doi.org/10.1016/j.foodchem.2004.11.019
. [all data]
Selli, Canbas, et al., 2006, 2
Selli, S.; Canbas, A.; Cabaroglu, T.; Erten, H.; Lepoutre, J.-P.; Gunata, Z.,
Effect of skin contact on the free and bound aroma compounds of the white wine of Vitis vinifera L. cv Narince,
Food Control, 2006, 17, 1, 75-82, https://doi.org/10.1016/j.foodcont.2004.09.005
. [all data]
Aubert, Baumann, et al., 2005
Aubert, C.; Baumann, S.; Arguel, H.,
Optimization of the Analysis of Flavor Volatile Compounds by Liquid-Liquid Microextraction (LLME). Application to the Aroma Analysis of Melons, Peaches, Grapes, Strawberries, and Tomatoes,
J. Agric. Food Chem., 2005, 53, 23, 8881-8895, https://doi.org/10.1021/jf0510541
. [all data]
Howard, Mike, et al., 2005
Howard, K.L.; Mike, J.H.; Riesen, R.,
Validation of a Solid-Phase Microextraction Method for Headspace Analysis of Wine Aroma Components,
Am. J. Enol. Vitic, 2005, 56, 1, 37-45. [all data]
Kaack, Christensen, et al., 2005
Kaack, K.; Christensen, L.P.; Hughes, M.; Eder, R.,
The relationship between sensory quality and volatile compounds in raw juice processed from elderberries ( Sambucus nigra L.),
Eur. Food Res. Technol., 2005, 221, 3-4, 244-254, https://doi.org/10.1007/s00217-005-1141-4
. [all data]
Klesk, Qian, et al., 2004
Klesk, K.; Qian, M.; Martin, R.R.,
Aroma extract dilution analysis of cv. meeker (Rubus idaeus L.) red raspberries from Oregon and Washington,
J. Agric. Food Chem., 2004, 52, 16, 5155-5161, https://doi.org/10.1021/jf0498721
. [all data]
Selli, Cabaroglu, et al., 2004
Selli, S.; Cabaroglu, T.; Canbas, A.; Erten, H.; Nurgel, C.; Lepoutre, J.P.; Gunata, Z.,
Volatile composition of red wine from cv. Kalecik Karasi grown in central Anatolia,
Food Chem., 2004, 85, 2, 207-213, https://doi.org/10.1016/j.foodchem.2003.06.008
. [all data]
Boido, Lloret, et al., 2003
Boido, E.; Lloret, A.; Medina, K.; Fariña, L.; Carrau, f.; Versini, G.; Dellacassa, E.,
Aroma composition of Vitis vinifera Cv. Tannat: the typical red wine from Uruguay,
J. Agric. Food Chem., 2003, 51, 18, 5408-5413, https://doi.org/10.1021/jf030087i
. [all data]
da Porto, Pizzale, et al., 2003
da Porto, C.; Pizzale, L.; Bravin, M.; Conte, L.S.,
Analyses of orange spirit flavour by direct-injection gas chromatography-mass spectrometry and headspace solid-phase microextraction/GC-MC,
Flavour Fragr. J., 2003, 18, 1, 66-72, https://doi.org/10.1002/ffj.1164
. [all data]
Koprivnjak, Conte, et al., 2002
Koprivnjak, O.; Conte, L.; Totis, N.,
Influence of olive fruit storage in bags on oil quality and composition of volatile compounds,
Food Technol. Biotechnol., 2002, 40, 2, 129-134. [all data]
Nurgel, Erten, et al., 2002
Nurgel, C.; Erten, H.; Canbas, A.; Cabaroglu, T.; Selli, S.,
Contribution by Saccharomyces cerevisiae yeasts to fermentation and flavour compounds in wines from cv. Kalecik karasi grape,
J. Inst. Brew., 2002, 108, 1, 68-72, https://doi.org/10.1002/j.2050-0416.2002.tb00126.x
. [all data]
Cantergiani, Brevard, et al., 2001
Cantergiani, E.; Brevard, H.; Krebs, Y.; Feria-Morales, A.; Amadò, R.; Yeretzian, C.,
Characterisation of the aroma of green Mexican coffee and identification of mouldy/earthy defect,
Eur. Food Res. Technol., 2001, 212, 6, 648-657, https://doi.org/10.1007/s002170100305
. [all data]
Yasuhara, 1987
Yasuhara, A.,
Identification of Volatile Compounds in Poultry Manure by Gas Chromatography-Mass Spectrometry,
J. Chromatogr., 1987, 387, 371-378, https://doi.org/10.1016/S0021-9673(01)94539-X
. [all data]
Whitfield, Shea, et al., 1981
Whitfield, F.B.; Shea, S.R.; Gillen, K.J.; Shaw, K.J.,
Volatile components from the roots of Acacia pulchella R.Br. and their effect on Phytophthora cinnamomi rands,
Aust. J. Bot., 1981, 29, 2, 195-208, https://doi.org/10.1071/BT9810195
. [all data]
Shimadzu, 2003, 2
Shimadzu,
Gas chromatography analysis of organic solvents using capillary columns (No. 3), 2003, retrieved from http://www.shimadzu.com/apps/form.cfm. [all data]
Yabumoto, Jennings, et al., 1977
Yabumoto, K.; Jennings, W.G.; Yamaguchi, M.,
Gas chromatographic retention as identification criteria,
Anal. Biochem., 1977, 78, 1, 244-251, https://doi.org/10.1016/0003-2697(77)90029-X
. [all data]
Goeminne, Vandendriessche, et al., 2012
Goeminne, P.C.; Vandendriessche, T.; Van Eldere, J.; Nicolai, B.M.; Hertog, M.L.; Dupont, L.J.,
Detection of Pseudomonas aeruginosa in sputum headspace through volatile organic compound analysis,
Respiratory Res., 2012, 13, 87, 1-9. [all data]
Leffingwell and Alford, 2011
Leffingwell, J.; Alford, E.D.,
Volatile constituents of the giant pufball mushroom (Calvatia gigantea),
Leffingwell Rep., 2011, 4, 1-17. [all data]
Takeoka, Hobbs, et al., 2010
Takeoka, G.R.; Hobbs, C.; Byeoung-Soo, P.,
Volatile constituents of the aerial parts of Salvia apiana Jepson,
J. Essential Oil. Res., 2010, 22, 3, 241-244, https://doi.org/10.1080/10412905.2010.9700314
. [all data]
Laselan, Buettner, et al., 2009
Laselan, P.; Buettner, A.; Christlbauer, M.,
Investigation of the retronasal perseption of palm wine (Elaeis guineensis) aroma by application of sensory analysis and exhaled odorant measurement (EXOM),
African J. of Food, Agriculture, Nutrition and development, 2009, 9, 2, 793-813. [all data]
Forero, Quijano, et al., 2008
Forero, M.D.; Quijano, C.E.; Pino, J.A.,
Volatile compounds of Chile pepper (Capsicum annuum L. var. glabriusculum) at two ripening stages,
Flavour Fragr. J., 2008, 24, 1, 25-30, https://doi.org/10.1002/ffj.1913
. [all data]
Kumazawa, Itobe, et al., 2008
Kumazawa, K.; Itobe, T.; Nishimura, O.; Hamaguchi, T.,
A new approach to estimate the in-mouth release characteristics of odorants in chewing gum,
Food Science and Technology Research, 2008, 14, 3, 269-276, https://doi.org/10.3136/fstr.14.269
. [all data]
Mierendorff, Stahl-Biskup, et al., 2008
Mierendorff, H.-G.; Stahl-Biskup, E.; Posthumus, M.A.; van Beek, T.A.,
Composition of commercial Cape chamomile oil (Eriocephalus punctuatus / Eriocephalus tenuifolius), 2008, retrieved from http://www.chemische-analysen-hamburg.de/Publikationen?CapeChamomileOil/. [all data]
Setkova, Risticevic, et al., 2007
Setkova, L.; Risticevic, S.; Pawliszyn, J.,
Rapid headspace solid-phase microextraction-gas chromatographic?time-of-flight mass spectrometric method for qualitative profiling of ice wine volatile fraction II: Classification of Canadian and Czech ice wines using statistical evaluation of the data,
J. Chromatogr. A, 2007, 1147, 2, 224-240, https://doi.org/10.1016/j.chroma.2007.02.052
. [all data]
Xu, Fan, et al., 2007
Xu, Y.; Fan, W.; Qian, M.C.,
Characterization of Aroma Compounds in Apple Cider Using Solvent-Assisted Flavor Evaporation and Headspace Solid-Phase Microextraction,
J. Agric. Food Chem., 2007, 55, 8, 3051-3057, https://doi.org/10.1021/jf0631732
. [all data]
Fan and Qian, 2006
Fan, W.; Qian, M.C.,
Characterization of Aroma Compounds of Chinese Wuliangye and Jiannanchun Liquors by Aroma Extract Dilution Analysis,
J. Agric. Food Chem., 2006, 54, 7, 2695-2704, https://doi.org/10.1021/jf052635t
. [all data]
Fan and Qian, 2006, 2
Fan, W.; Qian, M.C.,
Identification of aroma compounds in Chinese 'Yanghe Daqu' liquor by normal phase chromatography fractionation followed by gas chromatography/olfactometry,
Flavour Fragr. J., 2006, 21, 2, 333-342, https://doi.org/10.1002/ffj.1621
. [all data]
de Souza, Vásquez, et al., 2006
de Souza, M.D.C.A.; Vásquez, P.; del Mastro, N.L.; Acree, T.E.; Lavin, E.H.,
Characterization and cachaca and rum aroma,
J. Agric. Food Chem., 2006, 54, 2, 485-488, https://doi.org/10.1021/jf0511190
. [all data]
El-Sayed, Heppelthwaite, et al., 2005
El-Sayed, A.M.; Heppelthwaite, V.J.; Manning, L.M.; Gibb, A.R.; Suckling, D.M.,
Volatile constituents of fermented sugar baits and their attraction to lepidopteran species,
J. Agric. Food Chem., 2005, 53, 4, 953-958, https://doi.org/10.1021/jf048521j
. [all data]
Fan and Qian, 2005
Fan, W.; Qian, M.C.,
Headspace Solid Phase Microextraction and Gas Chromatography-Olfactometry Dilution Analysis of Young and Aged Chinese Yanghe Daqu Liquors,
J. Agric. Food Chem., 2005, 53, 20, 7931-7938, https://doi.org/10.1021/jf051011k
. [all data]
Leffingwell and Alford, 2005
Leffingwell, J.C.; Alford, E.D.,
Volatile constituents of Perique tobacco,
Electron. J. Environ. Agric. Food Chem., 2005, 4, 2, 899-915. [all data]
Tesevic, Nikicevic, et al., 2005
Tesevic, V.; Nikicevic, N.; Jovanovic, A.; Djokovic, D.; Vujisic, L.; Vuckovic, I.; Bonic, M.,
Volatile components from old plum brandies,
Food Technol. Biotechnol., 2005, 43, 4, 367-372. [all data]
Azodanlou, Darbellay, et al., 2003
Azodanlou, R.; Darbellay, C.; Luisier, J.-L.; Villettaz, J.-C.; Amadò, R.,
Quality assessment of strawberries (Fragaria species),
J. Agric. Food Chem., 2003, 51, 3, 715-721, https://doi.org/10.1021/jf0200467
. [all data]
Ledauphin, Guichard, et al., 2003
Ledauphin, J.; Guichard, H.; Saint-Clair, J.-F.; Picoche, B.; Barillier, D.,
Chemical and sensorial aroma characterization of freshly distilled calvados. 2. Identification of volatile compounds and key odorants,
J. Agric. Food Chem., 2003, 51, 2, 433-442, https://doi.org/10.1021/jf020373e
. [all data]
Mierendorff, Stahl-Biskup, et al., 2003
Mierendorff, H.-G.; Stahl-Biskup, E.; Posthumus, M.A.; van Beek, T.A.,
Composition of commercial Cape chamomile oil (Eriocephalus punctulatus),
Flavour Fragr. J., 2003, 18, 6, 510-514, https://doi.org/10.1002/ffj.1259
. [all data]
Murakami, Goldstein, et al., 2003
Murakami, A.A.; Goldstein, H.; Navarro, A.; Seabrooks, J.R.; Ryder, D.S.,
Investigation of beer flavor by gas chromatography-olfactometry,
J. Am. Soc. Brew. Chem., 2003, 61, 1, 23-32, retrieved from http://www.asbcnet.org/Journal/samplepdfs/0127-01R.pdf. [all data]
Vichi, Pizzale, et al., 2003
Vichi, S.; Pizzale, L.; Conte, L.S.; Buxaderas, S.; López-Tamames, E.,
Solid-phase microextraction in the analysis of virgin olive oil volatile fraction: characterization of virgin olive oils from two distinct geographical areas of Northern Italy,
J. Agric. Food Chem., 2003, 51, 22, 6572-6577, https://doi.org/10.1021/jf030269c
. [all data]
Isidorov and Jdanova, 2002
Isidorov, V.; Jdanova, M.,
Volatile organic compounds from leaves litter,
Chemosphere, 2002, 48, 9, 975-979, https://doi.org/10.1016/S0045-6535(02)00074-7
. [all data]
Gallori, Flamini, et al., 2001
Gallori, S.; Flamini, G.; Bilia, A.R.; Morelli, I.; Landini, A.; Vincieri, F.F.,
Chemical composition of some traditional herbal drug preparations: essential oil and aromatic water of costmary (Balsamita suaveolens Pers.),
J. Agric. Food Chem., 2001, 49, 12, 5907-5910, https://doi.org/10.1021/jf0107656
. [all data]
Kotseridis and Baumes, 2000
Kotseridis, Y.; Baumes, R.,
Identification of impact odorants in Bordeaux red grape juice, in the commercial yeast used for its fermentation, and in the produced wine,
J. Agric. Food Chem., 2000, 48, 2, 400-406, https://doi.org/10.1021/jf990565i
. [all data]
Vendramini and Trugo, 2000
Vendramini, A.L.; Trugo, L.C.,
Chemical composition of acerola fruit (Malpighia punicifolia L.) at three stages of maturity,
Food Chem., 2000, 71, 2, 195-198, https://doi.org/10.1016/S0308-8146(00)00152-7
. [all data]
Lopez, Ferreira, et al., 1999
Lopez, R.; Ferreira, V.; Hernandez, P.; Cacho, J.F.,
Identification of impact odorants of young red wines made with Merlot, Cabernet Sauvignon and Grenache grape varieties: a comparative study,
J. Sci. Food Agric., 1999, 79, 11, 1461-1467, https://doi.org/10.1002/(SICI)1097-0010(199908)79:11<1461::AID-JSFA388>3.0.CO;2-K
. [all data]
Oberhofer, Nikiforov, et al., 1999
Oberhofer, B.; Nikiforov, A.; Buchbauer, G.; Jirovetz, L.; Bicchi, C.,
Investigation of the alteration of the composition of various essential oils used in aroma lamp applications,
Flavour Fragr. J., 1999, 14, 5, 293-299, https://doi.org/10.1002/(SICI)1099-1026(199909/10)14:5<293::AID-FFJ829>3.0.CO;2-T
. [all data]
Ong and Acree, 1998
Ong, P.K.C.; Acree, T.E.,
Gas chromatography/olfactory analysis of lychee (Litchi chinesis Sonn.),
J. Agric. Food Chem., 1998, 46, 6, 2282-2286, https://doi.org/10.1021/jf9801318
. [all data]
Ong, Acree, et al., 1998
Ong, P.K.C.; Acree, T.E.; Lavin, E.H.,
Characterization of volatiles in rambutan fruit (Nephelium lappaceum L.),
J. Agric. Food Chem., 1998, 46, 2, 611-615, https://doi.org/10.1021/jf970665t
. [all data]
Larsen and Frisvad, 1995
Larsen, T.O.; Frisvad, J.C.,
Characterization of volatile metabolites from 47 Penicillium taxa,
Mycol. Res., 1995, 99, 10, 1153-1166, https://doi.org/10.1016/S0953-7562(09)80271-2
. [all data]
Gomez and Ledbetter, 1994
Gomez, E.; Ledbetter, C.A.,
Comparative study of the aromatic profiles of two different plum species: Prunus salicina Lindl and Prunus simonii L.,
J. Sci. Food Agric., 1994, 65, 1, 111-115, https://doi.org/10.1002/jsfa.2740650116
. [all data]
Egolf and Jurs, 1993
Egolf, L.M.; Jurs, P.C.,
Quantitative structure-retention and structure-odor intensity relationships for a diverse group of odor-active compounds,
Anal. Chem., 1993, 65, 21, 3119-3126, https://doi.org/10.1021/ac00069a027
. [all data]
Shimoda, Shibamoto, et al., 1993
Shimoda, M.; Shibamoto, T.; Noble, A.C.,
Evaluation of heaspace volatiles of Cabernet Sauvignon wines sampled by an on-column method,
J. Agric. Food Chem., 1993, 41, 10, 1664-1668, https://doi.org/10.1021/jf00034a028
. [all data]
Shiota, 1993
Shiota, H.,
New esteric components in the volatiles of banana fruit (Musa sapientum L.),
J. Agric. Food Chem., 1993, 41, 11, 2056-2062, https://doi.org/10.1021/jf00035a046
. [all data]
Peppard, 1992
Peppard, T.L.,
Volatile flavor constituents of Monstera deliciosa,
J. Agric. Food Chem., 1992, 40, 2, 257-262, https://doi.org/10.1021/jf00014a018
. [all data]
Anker, Jurs, et al., 1990
Anker, L.S.; Jurs, P.C.; Edwards, P.A.,
Quantitative structure-retention relationship studies of odor-active aliphatic compounds with oxygen-containing functional groups,
Anal. Chem., 1990, 62, 24, 2676-2684, https://doi.org/10.1021/ac00223a006
. [all data]
Takeoka and Butter, 1989
Takeoka, G.; Butter, R.G.,
Volatile constituents of pineapple (Ananas Comosus [L.] Merr.)
in Flavor Chemistry. Trends and Developments, Teranishi,R.; Buttery,R.G.; Shahidi,F., ed(s)., American Chemical Society, Washington, DC, 1989, 223-237. [all data]
del Rosario, de Lumen, et al., 1984
del Rosario, R.; de Lumen, B.O.; Habu, T.; Flath, R.A.; Mon, T.R.; Teranishi, R.,
Comparison of headspace volatiles from winged beans and soybeans,
J. Agric. Food Chem., 1984, 32, 5, 1011-1015, https://doi.org/10.1021/jf00125a015
. [all data]
Dirinck, de Pooter, et al., 1981
Dirinck, P.J.; de Pooter, H.L.; Willaert, G.A.; Schamp, N.M.,
Flavor quality of cultivated strawberries: the role of the sulfur compounds,
J. Agric. Food Chem., 1981, 29, 2, 316-321, https://doi.org/10.1021/jf00104a024
. [all data]
Schreyen, Dirinck, et al., 1979
Schreyen, L.; Dirinck, P.; Sandra, P.; Schamp, N.,
Flavor analysis of quince,
J. Agric. Food Chem., 1979, 27, 4, 872-876, https://doi.org/10.1021/jf60224a058
. [all data]
Collin, Nizet, et al., 2012
Collin, S.; Nizet, S.; Gros, J.,
Le houblonnage a cru des bieres speciales belges est bien plus qu'une simple dissolution des composes aromatiques du houblon (in Flamish),
Cerevisia, 2012, 36, 4, 119-124, https://doi.org/10.1016/j.cervis.2011.12.001
. [all data]
Collin, Nizet, et al., 2012, 2
Collin, S.; Nizet, S.; Bouuaert, T.C.; Despartures, P.-M.,
MAin odorants in Jura Flor-Sherry wines. Relative contributions of sotolon, abhexon, and theaspirane-derived compounds,
J. Agr. Food Chem., 2012, 60, 1, 380-381, https://doi.org/10.1021/jf203832c
. [all data]
VOC BinBase, 2012
VOC BinBase,
The volatile compound BinBase (VOC BinBase), 2012, retrieved from http://fiehnlab.ucdavis.edu/projects/VocBinBase and http://binbase.sourceforge.net. [all data]
Citron, Riclea, et al., 2011
Citron, C.A.; Riclea, R.; Brock, N.L.; Dickschat, J.S.,
Biosynthesis of acorane sesquiterpenes by Trichoderma. Electronic supplemental materials (ESI),
Royal Soc. Chem., 2011, 1-10. [all data]
de Freitas, Garruti, et al., 2011
de Freitas, V.M.; Garruti, D. dosS.; Souza Neto, M.A.; Facundo, H.V. daV.; Correia, J.M.,
Stability of volatile profile and sensory properties of passion fruit during storage in glass bottles,
Ciencia e Tecnologia de Alimentos, Campinas, 2011, 31, 2, 349-354, https://doi.org/10.1590/S0101-20612011000200011
. [all data]
Skogerson, Wohlgemuth, et al., 2011
Skogerson, K.; Wohlgemuth, G.; Fiehn, O.,
VocBinNase, 2011, retrieved from http://fiehnlab.ucdavis.edu/projects//VocBinBase. [all data]
Di Giusto, Bessiere, et al., 2010
Di Giusto, B.; Bessiere, J.-M.; Gueroult, M.; Lim, L.B.L.; Marshall, D.J.; Hossaert-McKey, M.; Gaume, L.,
Flower-scent mimicry masks a deadly trap in the carnivorous plant Nepenthes raffesiana,
J. Ecology, 2010, 98, 4, 845-856, https://doi.org/10.1111/j.1365-2745.2010.01665.x
. [all data]
Fan, Lu, et al., 2009
Fan, G.; Lu, W.; Yao, X.; Zhang, Y.; Wang, K.; Pan, S.,
effect of fermentation on free and bound volatile compounds of orange juice,
Flavour Fragr. J., 2009, 24, 5, 219-229, https://doi.org/10.1002/ffj.1931
. [all data]
se Souza, Cardeal, et al., 2009
se Souza, P.P.; Cardeal, Z.DeL.; Augusti, R.; Morrison, P.; Marriott, P.J.,
Determination of volatile compounds in Brazilian distilled cachaca by using comprehensive two-dimensional gas chromatography and effects of production pathways,
J. Chromatogr. A., 2009, 1216, 14, 2881-2890, https://doi.org/10.1016/j.chroma.2008.10.061
. [all data]
Collin, Nizet, et al., 2008
Collin, S.; Nizet, S.; Muls, S.; Iraqi, R.; Bouseta, A.,
Characterization of odor-active compounds in extracts obtained by simultaneous extraction/distillation from Moroccan black olives,
J. Agric. Food Chem., 2008, 56, 9, 3273-3278, https://doi.org/10.1021/jf073488x
. [all data]
Zhao, Li, et al., 2008
Zhao, Y.; Li, J.; Xu, Y.; Duan, H.; Fan, W.; Zhao, G.,
EXtraction, preparation and identification of volatile compounds in Changyu XO brandy,
Chinese J. Chromatogr., 2008, 26, 2, 212-222, https://doi.org/10.1016/S1872-2059(08)60014-0
. [all data]
Barra, Baldovini, et al., 2007
Barra, A.; Baldovini, N.; Loiseau, A.-M.; Albino, L.; Lesecq, C.; Cuvelier, L.L.,
Chemical analysis of French beans (Phaseolus vulgaris L.) by headspace solid phase microextraction (HS-SPME) and simultaneous distillation/extraction (SDE),
Food Chem., 2007, 101, 3, 1279-1284, https://doi.org/10.1016/j.foodchem.2005.12.027
. [all data]
Beaulieu and Lancaster, 2007
Beaulieu, J.C.; Lancaster, V.A.,
Correlating Volatile Compounds, Sensory Attributes, and Quality Parameters in Stored Fresh-Cut Cantaloupe,
J. Agric. Food Chem., 2007, 55, 23, 9503-9513, https://doi.org/10.1021/jf070282n
. [all data]
Bosch-Fuste, Riu-Aumatell, et al., 2007
Bosch-Fuste, J.; Riu-Aumatell, M.; Guadayol, J.M.; Caixach, J.; Lopez-Tamames, E.; Buxaderas, S.,
Volatile profiles of sparkling wines obtained by three extraction methods and gas chromatography-mass spectrometry (GC-MS) analysis,
Food Chem., 2007, 105, 1, 428-435, https://doi.org/10.1016/j.foodchem.2006.12.053
. [all data]
Karlshøj, Nielsen, et al., 2007
Karlshøj, K.; Nielsen, P.V.; Larsen, T.O.,
Prediction of Penicillium expansum Spoilage and Patulin Concentration in Apples Used for Apple Juice Production by Electronic Nose Analysis,
J. Agric. Food Chem., 2007, 55, 11, 4289-4298, https://doi.org/10.1021/jf070134x
. [all data]
Lasekan, Buettner, et al., 2007
Lasekan, O.; Buettner, A.; Christlbauer, M.,
Investigation of important odorants of palm wine (Elaeis guineensis),
Food Chem., 2007, 105, 1, 15-23, https://doi.org/10.1016/j.foodchem.2006.12.052
. [all data]
Liu, Liang, et al., 2007
Liu, F.; Liang, Y.; Cao, C.; Zhou, N.,
QSPR study of GC retention indices for saturated esters on seven stationary phases based on novel topological indices,
Talanta, 2007, 72, 4, 1307-1315, https://doi.org/10.1016/j.talanta.2007.01.038
. [all data]
Splivallo, Bossi, et al., 2007
Splivallo, R.; Bossi, S.; Maffei, M.; Bonfante, P.,
Discrimination of truffle fruiting body versus mycelial aromas by stir bar sorptive extraction,
Phytochemistry, 2007, 68, 20, 2584-2598, https://doi.org/10.1016/j.phytochem.2007.03.030
. [all data]
Callemien, Dasnoy, et al., 2006
Callemien, D.; Dasnoy, S.; Collin, S.,
Identification of a stale-beer-like odorant in extracts of naturally aged beer,
J. Agric. Food Chem., 2006, 54, 4, 1409-1413, https://doi.org/10.1021/jf051772n
. [all data]
Kubota T., Dorea H.S., et al., 2006
Kubota T.; Dorea H.S.; de Lima Nogueira P.C.,
Constituintes voláteis dos frutos de Hancornia speciosa (Apocynaceae), 29a Reunião Anual da Sociedade Brasileira de Química, PN-271, 2006, retrieved from https://sec.sbq.org.br/cd29ra/listaresumo.htm, https://sec.sbq.org.br/cd29ra/resumos/T1917-1.pdf. [all data]
Riu-Aumatell, Bosch-Fuste´, et al., 2006
Riu-Aumatell, M.; Bosch-Fuste´, J.; Lopez-Tamames, E.; Buxaderas, S.,
Development of volatile compounds of cava (Spanish sparkling wine) during long ageing time in contact with lees,
Food Chem., 2006, 95, 2, 237-242, https://doi.org/10.1016/j.foodchem.2005.01.029
. [all data]
Tognolini, Barocelli, et al., 2006
Tognolini, M.; Barocelli, E.; Ballabeni, V.; Bruni, R.; Bianchi, A.; Chiavarini, M.; Impicciatore, M.,
Comparative screening of plant essential oils: Phenylpropanoid moiety as basic core for antiplatelet activity,
Life Sciences, 2006, 78, 13, 1419-1432, https://doi.org/10.1016/j.lfs.2005.07.020
. [all data]
Beaulieu, 2005
Beaulieu, J.C.,
Within-Season Volatile and Quality Differences in Stored Fresh-Cut Cantaloupe Cultivars,
J. Agric. Food Chem., 2005, 53, 22, 8679-8687, https://doi.org/10.1021/jf050241w
. [all data]
Callamien, Dasnoy, et al., 2005
Callamien, D.; Dasnoy, S.; Heynen, O.; Badot, C.; Collin, S.,
Flavour stability of lager beer: identification of a new key staling compounds,
Eur. Brewery Convention, 2005, 91, 815-822. [all data]
Callemien, Dasnoy, et al., 2005
Callemien, D.; Dasnoy, S.; Heynen, O.; Badot, C.; Collin, S.,
Flavour stability of lager beer: identification of a new key staling compound
in European Brewery Convention, Fachverlag Hans Carl, Nurnberg, Germany, 2005, 815-822. [all data]
Pino, Marbot, et al., 2005
Pino, J.A.; Marbot, R.; Rosado, A.; Vázquez, C.,
Volatile constituents of Malay rose apple [Syzygium malaccense (L.) Merr. Perry],
Flavour Fragr. J., 2005, 20, 98-100. [all data]
Buettner, 2004
Buettner, A.,
Investigation of potent odorants and afterodor development in two chardonnay wines using the Buccal Odor Screening System (BOSS),
J. Agric. Food Chem., 2004, 52, 8, 2339-2346, https://doi.org/10.1021/jf035322b
. [all data]
Counet, Ouwerx, et al., 2004
Counet, C.; Ouwerx, C.; Rosoux, D.; Collin, S.,
Relationship between procyanidin and flavor contents of cocoa liquors from different origins,
J. Agric. Food Chem., 2004, 52, 20, 6243-6249, https://doi.org/10.1021/jf040105b
. [all data]
El-Shazily, Hafez, et al., 2004
El-Shazily, A.M.; Hafez, S.S.; Wink, M.,
Comparative study of the essential oils and extracts of Achillea fragrantissima (Forssk.) Sch. Bip. and Achillea santolina L. (Asteraceae) from Egypt,
Pharmazie, 2004, 59, 226-230. [all data]
Escudero, Gogorza, et al., 2004
Escudero, A.; Gogorza, B.; Melús, M.A.; Ortín, N.; Cacho, J.; Ferreira, V.,
Characterization of the aroma of a wine from Maccabeo. Key role played by compounds with low odor activity values,
J. Agric. Food Chem., 2004, 52, 11, 3516-3524, https://doi.org/10.1021/jf035341l
. [all data]
Maia, Andrade, et al., 2004
Maia, J.G.S.; Andrade, E.H.A.; Zoghbi, M.G.B.,
Aroma volatiles from two fruit varieties of jackfruit (Artocarpus heterophyllus Lam.),
Food Chem., 2004, 85, 2, 195-197, https://doi.org/10.1016/S0308-8146(03)00292-9
. [all data]
Vinogradov, 2004
Vinogradov, B.A.,
Production, composition, properties and application of essential oils, 2004, retrieved from http://viness.narod.ru. [all data]
Alves and Franco, 2003
Alves, G.L.; Franco, M.R.B.,
Headspace gas chromatography-mass spectrometry of volatile compounds in murici (Byrsonima crassifolia L. Rich),
J. Chromatogr. A, 2003, 985, 1-2, 297-301, https://doi.org/10.1016/S0021-9673(02)01398-5
. [all data]
Demyttenaere, Dagher, et al., 2003
Demyttenaere, J.C.R.; Dagher, C.; Sandra, P.; Kallithraka, S.; Verhé, R.; de Kimpe, N.,
Flavour analysis of Greek white wine by solid-phase microextraction-capillary gas chromatography-mass spectrometry,
J. Chromatogr. A, 2003, 985, 1-2, 233-246, https://doi.org/10.1016/S0021-9673(02)01467-X
. [all data]
Demyttenaere, Dagher, et al., 2002
Demyttenaere, J.C.R.; Dagher, C.; Verhé, R.; Sandra, P.,
Flavour analysis of Greek white wine using solid phase microextraction - capillary GC/MS
in 25th International Symposium on Capillary Chromatography, 2002, 1-16. [all data]
Ferreira, Ortín, et al., 2002
Ferreira, V.; Ortín, N.; Escudero, A.; López, R.; Cacho, J.,
Chemical characterization of the aroma of grenache Rosé wines: aroma extract dilution analysis, quantitative determination, and sensory reconstitution studies,
J. Agric. Food Chem., 2002, 50, 14, 4048-4054, https://doi.org/10.1021/jf0115645
. [all data]
Jordán, Goodner, et al., 2002
Jordán, M.J.; Goodner, K.L.; Shaw, P.E.,
Characterization of the aromatic profile in aqueous essence and fruit juice of yellow passion fruit (Passiflora edulis Sims F. Flavicarpa degner) by GC-MS and GC/O,
J. Agric. Food Chem., 2002, 50, 6, 1523-1528, https://doi.org/10.1021/jf011077p
. [all data]
Ansorena, Gimeno, et al., 2001
Ansorena, D.; Gimeno, O.; Astiasarán, I.; Bello, J.,
Analysis of volatile compounds by GC-MS of a dry fermented sausage: chorizo de Pamplona,
Food Res. Int., 2001, 34, 1, 67-75, https://doi.org/10.1016/S0963-9969(00)00133-2
. [all data]
Lermusieau, Bulens, et al., 2001
Lermusieau, G.; Bulens, M.; Collin, S.,
Use of GC-olfactometry to identify the hop aromatic compounds in beer,
J. Agric. Food Chem., 2001, 49, 8, 3867-3874, https://doi.org/10.1021/jf0101509
. [all data]
Flanagan, Streete, et al., 1997
Flanagan, R.J.; Streete, P.J.; Ramsey, J.D.,
Volatile Substance Abuse, UNODC Technical Series, No 5, United Nations, Office on Drugs and Crime, Vienna International Centre, PO Box 500, A-1400 Vienna, Austria, 1997, 56, retrieved from http://www.odccp.org/pdf/technicalseries1997-01-011.pdf. [all data]
Guth, 1997
Guth, H.,
Identification of character impact odorants of different white wine varieties,
J. Agric. Food Chem., 1997, 45, 8, 3022-3026, https://doi.org/10.1021/jf9608433
. [all data]
Storer, Elmore, et al., 1993
Storer, J.R.; Elmore, J.S.; van Emden, H.F.,
Airborne volatiles from the foliage of three cultivars of autumn flowering chrysanthemums,
Phytochemistry, 1993, 34, 6, 1489-1492, https://doi.org/10.1016/S0031-9422(00)90833-1
. [all data]
Strete, Ruprah, et al., 1992
Strete, P.J.; Ruprah, M.; Ramsey, J.D.; Flanagan, R.J.,
Detection and identification of volatile substances by headspace capillary gas chromatography to aid the diagnosis of acute poisoning,
Analyst, 1992, 117, 7, 1111-1127, https://doi.org/10.1039/an9921701111
. [all data]
Takeoka, Flath, et al., 1988
Takeoka, G.R.; Flath, R.A.; Güntert, M.; Jennings, W.,
Nectarine volatiles: vacuum steam distillation versus headspace sampling,
J. Agric. Food Chem., 1988, 36, 3, 553-560, https://doi.org/10.1021/jf00081a037
. [all data]
Waggott and Davies, 1984
Waggott, A.; Davies, I.W.,
Identification of organic pollutants using linear temperature programmed retention indices (LTPRIs) - Part II, 1984, retrieved from http://dwi.defra.gov.uk/research/completed-research/reports/dwi0383.pdf. [all data]
Alves, da Penha, et al., 2012
Alves, V.C.C.; da Penha, M.F.A.; Pinto, N. deO.F.; Garruti, D. dosS.,
Volatile compounds profile of Musa FHIA 02: an option to counter losses by Black Sigatoka,
Nat. Prod. J., 2012, 5, 55-60. [all data]
Duarte, Dias, et al., 2010
Duarte, W.F.; Dias, D.R.; Oliveira, J.M.; Teixeira, J.A.; de Almeida e Silva, J.B.; Schwan, R.F.,
Characterization of different fruit wines made from cacao,cupuassu, gabiroba, jaboticaba and umbu,
Food Sci. Technol., 2010, 43, 1564-1572. [all data]
Mallia, Escher, et al., 2009
Mallia, S.; Escher, F.; Dubois, S.; Schieberle, P.; Schlichtherle-Cerny, H.,
Characterization and quantification of odor-active compounds in unsaturated fatty acid/conjugated linoleic acid (UFA/CLA)-enriched butter and in conventional butter during storage and induced oxidation,
J. Agric. Food Chem., 2009, 57, 16, 7464-7472, https://doi.org/10.1021/jf9002158
. [all data]
Callejon, Morales, et al., 2008
Callejon, R.M.; Morales, M.L.; Ferreira, A.C.S.; Troncoso, A.M.,
Defining the typical aroma of sherry vinegar: sensory and chemical approach,
J. Agric. Food Chem., 2008, 56, 17, 8086-8095, https://doi.org/10.1021/jf800903n
. [all data]
Caldeira, de Sousa, et al., 2008
Caldeira, I.; de Sousa, R.B.; Balchior, A.P.; Climaco, M.C.,
A sensory and chemical approach to the aroma of wooden aged Lourinha wine brandy,
Ciencia Tec. Vitiv., 2008, 23, 2, 97-110. [all data]
Charoensiddhi and Anprung, 2008
Charoensiddhi, S.; Anprung, P.,
Bioacrive compounds and volatile compounds of Thai bael fruit (Aegle marmelos (L.) Correa) as a valuable source for functional food ingredients,
Internat. Food Res. J., 2008, 15, 3, 287-295. [all data]
Choi, 2006
Choi, H.-S.,
Headspace analyses of fresh leaves and stems of Angelica gigas Nakai, a Korean medicinal herb,
Flavour Fragr. J., 2006, 21, 4, 604-608, https://doi.org/10.1002/ffj.1602
. [all data]
Kishimoto, Wanikawa, et al., 2006
Kishimoto, T.; Wanikawa, A.; Kono, K.; Shibata, K.,
Comparison of the Odor-Active Compounds in Unhopped Beer and Beers Hopped with Different Hop Varieties,
J. Agric. Food Chem., 2006, 54, 23, 8855-8861, https://doi.org/10.1021/jf061342c
. [all data]
Komes, Ulrich, et al., 2006
Komes, D.; Ulrich, D.; Lovric, T.,
Characterization of odor-active compounds in Croatian Rhine Riesling wine, subregion Zagorje,
Eur. Food Res. Technol., 2006, 222, 1-2, 1-7, https://doi.org/10.1007/s00217-005-0094-y
. [all data]
Isogai, Utsunomiya, et al., 2005
Isogai, A.; Utsunomiya, H.; Kanda, R.; Iwata, H.,
Changes in the Aroma Compounds of Sake during Aging,
J. Agric. Food Chem., 2005, 53, 10, 4118-4123, https://doi.org/10.1021/jf047933p
. [all data]
Culleré, Escudero, et al., 2004
Culleré, L.; Escudero, A.; Cacho, J.; Ferreira, V.,
Gas chromatography-olfactometry and chemical quantitative study of the aroma of six premium auality Spanish aged red wines,
J. Agric. Food Chem., 2004, 52, 6, 1653-1660, https://doi.org/10.1021/jf0350820
. [all data]
Narain, Almeida, et al., 2004
Narain, N.; Almeida, J.N.; Galvão, M.S.; Madruga, M.S.; de Brito, E.S.,
Volatile compounds in passion fruit (Passiflora edulis forma Flavicarpa) and yellow mombin (Spondias mombin L.) fruits obtained by dynamic headspace technique,
Cienc. Tecnol. Aliment. Campinas, 2004, 24, 2, 212-216, https://doi.org/10.1590/S0101-20612004000200009
. [all data]
Lee and Noble, 2003
Lee, S.-J.; Noble, A.C.,
Characterization of odor-active compounds in Californian Chardonnay wines using GC-olfactometry and GC-mass spectrometry,
J. Agric. Food Chem., 2003, 51, 27, 8036-8044, https://doi.org/10.1021/jf034747v
. [all data]
López, Ortín, et al., 2003
López, R.; Ortín, N.; Pérez-Trujillo, J.P.; Cacho, J.; Ferreira, V.,
Impact odorants of different young white wines from the Canary islands,
J. Agric. Food Chem., 2003, 51, 11, 3419-3425, https://doi.org/10.1021/jf026045w
. [all data]
Vichi, Castellote, et al., 2003
Vichi, S.; Castellote, A.I.; Pizzale, L.; Conte, L.S.; Buxaderas, S.; López-Tamames, E.,
Analysis of virgin olive oil volatile compounds by headspace solid-phase microextraction coupled to gas chromatography with mass spectrometric and flame ionization detection,
J. Chromatogr. A, 2003, 983, 1-2, 19-33, https://doi.org/10.1016/S0021-9673(02)01691-6
. [all data]
Lecanu, Ducruet, et al., 2002
Lecanu, L.; Ducruet, V.; Jouquand, C.; Gratadoux, J.J.; Feigenbaum, A.,
Optimization of headspace solid-phase microextraction (SPME) for the odor analysis of surface-ripened cheese,
J. Agric. Food Chem., 2002, 50, 13, 3810-3817, https://doi.org/10.1021/jf0117107
. [all data]
Ferreira, Aznar, et al., 2001
Ferreira, V.; Aznar, M.; López, R.; Cacho, J.,
Quantitative gas chromatography-olfactometry carried out at different dilutions of an extract. Differences in the odor profiles of four high-quality spanish aged red wines,
J. Agric. Food Chem., 2001, 49, 10, 4818-4824, https://doi.org/10.1021/jf010283u
. [all data]
Wei, Mura, et al., 2001
Wei, A.; Mura, K.; Shibamoto, T.,
Antioxidative activity of volatile chemicals extracted from beer,
J. Agric. Food Chem., 2001, 49, 8, 4097-4101, https://doi.org/10.1021/jf010325e
. [all data]
Korány, Mednyánszky, et al., 2000
Korány, K.; Mednyánszky, Zs.; Amtmann, M.,
Preliminary results of a recognition method visualizing the aroma and fragrance features,
Acta Aliment., 2000, 29, 2, 187-198, https://doi.org/10.1556/AAlim.29.2000.2.9
. [all data]
Campeanu, Burcea, et al., 1998
Campeanu, G.; Burcea, M.; Doneanu, C.; Namolosanu, I.; Visan, L.,
GC/MS characterization of the volatiles isolated from the wines obtained from the indigenous cultivar Feteasca Regala,
Analusis, 1998, 26, 2, 93-97, https://doi.org/10.1051/analusis:1998117
. [all data]
Ferreira, Ardanuy, et al., 1998
Ferreira, V.; Ardanuy, M.; López, R.; Cacho, J.F.,
Relationship between flavor dilution values and odor unit values in hydroalcoholic solutions: role of volatility and a practical rule for its estimation,
J. Agric. Food Chem., 1998, 46, 10, 4341-4346, https://doi.org/10.1021/jf980144l
. [all data]
Ferreira, Lopez, et al., 1998
Ferreira, V.; Lopez, R.; Escudero, A.; Cacho, J.F.,
The Aroma of Red Wine: Hierarchy Grenache and Nature of its Main Odorants,
J. Sci. Food Agric., 1998, 77, 2, 259-267, https://doi.org/10.1002/(SICI)1097-0010(199806)77:2<259::AID-JSFA36>3.0.CO;2-Q
. [all data]
Wada and Shibamoto, 1997
Wada, K.; Shibamoto, T.,
Isolation and identification of volatile compounds from a wine using solid phase extraction, gas chromatography, and gas chromatography/mass spectrometry,
J. Agric. Food Chem., 1997, 45, 11, 4362-4366, https://doi.org/10.1021/jf970157j
. [all data]
Wong and Lai, 1996
Wong, K.C.; Lai, F.Y.,
Volatile constituents from the fruits of four Syzygium species grown in Malaysia,
Flavour Fragr. J., 1996, 11, 1, 61-66, https://doi.org/10.1002/(SICI)1099-1026(199601)11:1<61::AID-FFJ539>3.0.CO;2-1
. [all data]
Lee, Chong, et al., 2012
Lee, P.-R.; Chong, I.S.-M.; Yu, B.; Curran, P.; Liu, S.-Q.,
Effect of precursors on volatile compounds in Papaya wine fermented by mixed yeasts,
Uncorrected proof, 2012, 000-000. [all data]
Johanningsmeier and McFeeters, 2011
Johanningsmeier, S.D.; McFeeters, R.F.,
Detection of volatile spoilage metabolites in fermented cucumbers using nontargeted, comprehensive 2-dimensional gas chromatography-time-of-flight mass spectrometry (GCxGCxTOFMS),
J. Food Sci., 2011, 76, 1, c168-c177, https://doi.org/10.1111/j.1750-3841.2010.01918.x
. [all data]
Sampaio, Garruti, et al., 2011
Sampaio, K.S.; Garruti, D.S.; Franco, M.R.B.; Janzantti, N.S.; Da Silva, M.A.AP.,
Aroma volatiles recovered in the water phase of cashew apple (Anacardium occidentale L.) juice during concentration,
J. Sci. Food Agric., 2011, 91, 10, 1801-1809, https://doi.org/10.1002/jsfa.4385
. [all data]
Xiao, Dai, et al., 2011
Xiao, Z.; Dai, S.; Niu, Y.; Yu, H.; Zhu, J.; Tian, H.; Gu, Y.,
Discrimination of Chinese vinegars based on headspace solid-phase microextraction - gas chromatography mass spectrometry of volatile compounds and multivariate analysis,
J. Food Sci., 2011, 76, 8, c1125-c1135, https://doi.org/10.1111/j.1750-3841.2011.02356.x
. [all data]
San-Juan, Petka, et al., 2010
San-Juan, F.; Petka, J.; Cacho, J.; Ferreira, V.; Escudero, A.,
Producing headspace extracts for the gas chromatography - olphactometric evaluation of wine aroma,
Food Chemistry, 2010, 123, 1, 188-195, https://doi.org/10.1016/j.foodchem.2010.03.129
. [all data]
Ferreira, Juan, et al., 2009
Ferreira, V.; Juan, F.S.; Escudero, A.; Cullere, L.; Fernandez-Zurbano, P.; Saenz-Navajas, M.P.; Cacho, J.,
Modeling quality of premium Spanish red wines from gas chromatography-olfactometry data,
J. Agr. Food. Chem., 2009, 57, 16, 7490-7498, https://doi.org/10.1021/jf9006483
. [all data]
Rodrigues, Caldera, et al., 2008
Rodrigues, F.; Caldera, M.; Camara, J.S.,
development of a dynamic headspace solid-phase microextraction procedure coupled to GC-qMSD for evaluation the chemical profile in alcoholic beverages,
Anal. Chim. Acta, 2008, 609, 1, 82-104, https://doi.org/10.1016/j.aca.2007.12.041
. [all data]
Tao, Wenlai, et al., 2008
Tao, L.; Wenlai, F.; Yan, X.,
Characterization of volatile and semi-volatile compounds in Chinese rica wines by headspace solid phase microextraction followed by gas chromatography - mass spectrometry,
J. Inst. Brew., 2008, 114, 2, 172-179, https://doi.org/10.1002/j.2050-0416.2008.tb00323.x
. [all data]
Yongsheng, Hua, et al., 2008
Yongsheng, T.; Hua, L.; Hua, W.; Li, Z.,
Volatile composition of young Cabernet Savignon red wine from Changli Counti (China),
J. Food Composition and Analysis, 2008, 21, 8, 689-694, https://doi.org/10.1016/j.jfca.2008.05.007
. [all data]
Li, Tao, et al., 2007
Li, H.; Tao, Y.-S.; Wang, H.; Zhang, L.,
Impact odorants of Chardonnay dry white wine from Changli County (China),
Eur. Food Res. Technol., 2007, https://doi.org/10.1007/s00217-007-0722-9
. [all data]
Selli, 2007
Selli, S.,
Volatile constituents of orange obtained from moro oranges (Citrus Sinensis L. Osbeck),
J. Food Quality, 2007, 30, 3, 330-341, https://doi.org/10.1111/j.1745-4557.2007.00124.x
. [all data]
Tian, Zhang, et al., 2007
Tian, Y.; Zhang, X.; Huang, T.; Zou, K.; Zhou, J.,
Research advances on the essential oils from leaves of Eucalyptus,
Food Fermentation Ind. (Chinese), 2007, 33, 10, 143-147. [all data]
Weldegergis B.T., Tredoux A.G.J., et al., 2007
Weldegergis B.T.; Tredoux A.G.J.; Crouch A.M.,
Application of a headspace sorptive extraction method for the analysis of volatile components in South African wines,
J. Agric. Food Chem., 2007, 55, 21, 8696-8702, https://doi.org/10.1021/jf071554p
. [all data]
Baser, Özek, et al., 2004
Baser, K.H.C.; Özek, T.; Kirimer, N.; Deliorman, D.; Ergun, F.,
Composition of the essential oils of Galium aparine L. and Galium odoratum (L.) Scop. from Turkey,
J. Essent. Oil Res., 2004, 16, 4, 305-307, https://doi.org/10.1080/10412905.2004.9698728
. [all data]
Salinas, Zalacain, et al., 2004
Salinas, M.; Zalacain, A.; Pardo, F.; Alonso, G.L.,
Stir bar sorptive extraction applied to volatile constituents evolution during Vitis vinifera ripening,
J. Agric. Food Chem., 2004, 52, 15, 4821-4827, https://doi.org/10.1021/jf040040c
. [all data]
Selli, Kürkçüoglu, et al., 2004
Selli, S.; Kürkçüoglu, M.; Kafkas, E.; Cabaroglu, T.; Demirci, B.; Baser, K.H.C.; Canbas, A.,
Volatile flavour components of mandarin wine obtained from clementines (Citrus reticula Blanco) extracted by solid-phase microextraction,
Flavour Fragr. J., 2004, 19, 5, 413-416, https://doi.org/10.1002/ffj.1323
. [all data]
Garruti, Franco, et al., 2003
Garruti, D.S.; Franco, M.R.B.; da Silva, M.A.A.P.; Janzantti, N.S.; Alves, G.L.,
Evaluation of volatile flavour compounds from cashew apple (Anacardium occidentale L) juice by the Osme gas chromatography/olfactometry technique,
J. Sci. Food Agric., 2003, 83, 14, 1455-1462, https://doi.org/10.1002/jsfa.1560
. [all data]
Selli, Cabaroglu, et al., 2003
Selli, s.; Cabaroglu, T.; Canbas, A.,
Flavour components of orange wine made from a Turkish cv. Kozan,
Int. J. Food Sci. Technol., 2003, 38, 5, 587-593, https://doi.org/10.1046/j.1365-2621.2003.00691.x
. [all data]
Escalona, Birkmyre, et al., 2002
Escalona, H.; Birkmyre, L.; Piggott, J.R.; Paterson, A.,
Effect of maturation in small oak casks on the volatility of red wine aroma compounds,
Anal. Chim. Acta., 2002, 458, 1, 45-54, https://doi.org/10.1016/S0003-2670(01)01538-0
. [all data]
Rogerson and de Freitas, 2002
Rogerson, F.S.S.; de Freitas, V.A.P.,
Fortification spirit, a contributor to the aroma complexity of port,
J. Food Sci., 2002, 67, 4, 1564-1569, https://doi.org/10.1111/j.1365-2621.2002.tb10323.x
. [all data]
Torrens, 2002
Torrens, J.,
El análisis del aroma aplicado al control de calidad del cava [CS2002 Análisis sensorial (vino)], 2002, retrieved from http://www.percepnet.com/documenta/CS0203.pdf. [all data]
Escalona, Birkmyre, et al., 2001
Escalona, H.; Birkmyre, L.; Piggott, J.R.; Paterson, A.,
Relationship between sensory perception volatile and phenolic components in commercial Spanish red wines from different regions,
J. Inst. Brew., 2001, 107, 3, 157-166, https://doi.org/10.1002/j.2050-0416.2001.tb00087.x
. [all data]
Miranda, Nogueira, et al., 2001
Miranda, E.J.F.; Nogueira, R.I.; Pontes, S.M.; Rezende, C.M.,
Odour-active compounds of banana passa identified by aroma extract dilution analysis,
Flavour Fragr. J., 2001, 16, 4, 281-285, https://doi.org/10.1002/ffj.997
. [all data]
Tabanca N., Demirci F., et al., 2001
Tabanca N.; Demirci F.; Ozek T.; Tumen G.; Baser K.H.C.,
Composition and antimicrobial activity of the essential oil of Origanum x dolichosiphon P. H. Davis,
Chem. Nat. Compd. (Engl. Transl.), 2001, 37, 3, 238-241, https://doi.org/10.1023/A:1012513922871
. [all data]
Vas, Gal, et al., 1998
Vas, G.; Gal, L.; Harangi, J.; Dobo, A.; Vekey, K.,
Determination of volatile aroma compounds of Blaeufrankisch wines extracted by solid-phase microextraction,
J. Chromatogr. Sci., 1998, 36, 10, 505-510, https://doi.org/10.1093/chromsci/36.10.505
. [all data]
Vernin, Lageot, et al., 1998
Vernin, G.; Lageot, C.; Parkanyi, C.,
GC-MS(EI, PCI, NCI, SIM, ITMS) Data Bank Analysis of Flavors and Fragrances. Kovats indices
in Instrumental Methods on Food and Beverage Analysis, D. Wetzel, G. Charalambous, ed(s)., Elsevier Sci. B.V., Amsterdam, 1998, 245-301. [all data]
Carro Marino, López Tamames, et al., 1995
Carro Marino, N.; López Tamames, E.; García Jares, C.M.,
Contribution to the study of the aromatic potential of three muscat Vitis vinifera varieties: identification of new compounds,
Food Sci. Technol. Int., 1995, 1, 2-3, 105-116, https://doi.org/10.1177/108201329500100206
. [all data]
Chang, Seitz, et al., 1995
Chang, C.-Y.; Seitz, L.M.; Chambers, E., IV,
Volatile Flavor Components of Breads Made from Hard Red Winter Wheat and Hard White Winter Wheat,
Cereal Chem., 1995, 72, 3, 237-242. [all data]
Peppard and Ramus, 1988
Peppard, T.L.; Ramus, S.A.,
Use of Kovats' gas chromatographic retention indices in beer flavor studies,
Am. Soc. Brew. Chem. Proc., 1988, 46, 2, 26-30. [all data]
MacLeod and Pieris, 1981
MacLeod, A.J.; Pieris, N.M.,
Volatile flavor components of beli fruit (Aegle marmelos) and a processed product,
J. Agric. Food Chem., 1981, 29, 6, 1262-1264, https://doi.org/10.1021/jf00108a040
. [all data]