iridium carbide

Gas phase ion energetics data

Data compiled as indicated in comments:
RDSH - Henry M. Rosenstock, Keith Draxl, Bruce W. Steiner, and John T. Herron

Ionization energy determinations

IE (eV) Method Reference Comment
10. ± 1.EIMcIntyre, Auwera-Mahieu, et al., 1968RDSH

References

McIntyre, Auwera-Mahieu, et al., 1968
McIntyre, N.S.; Auwera-Mahieu, A.V.; Drowart, J., Mass spectrometric determination of the dissociation energies of gaseous RuC, IrC and PtB, J. Chem. Soc. Faraday Trans., 1968, 64, 3006. [all data]