2-Butenal, (E)-
- Formula: C4H6O
- Molecular weight: 70.0898
- IUPAC Standard InChIKey: MLUCVPSAIODCQM-NSCUHMNNSA-N
- CAS Registry Number: 123-73-9
- Chemical structure:
View 3d structure (requires JavaScript / HTML 5) - Stereoisomers:
- Other names: Crotonaldehyde, (E)-; (E)-Crotonaldehyde; trans-Crotonaldehyde; trans-2-Butenal; Topanel CA; E-Crotonic aldehyde; E-Crotylaldehyde; trans-Crotonal; Aldehyde crotonique; β-Methyl acrolein, trans; NCI-C56279; Rcra waste number U053; Topanel; But-(E)-2-enal; (E)-2-Butenal; (E)-But-2-enal; t-2-Butenal; 2-Butenal, (2E)-; 2-Butenal; Crotonal; Crotonaldehyde

Gas phase thermochemistry data

Data compiled by: Glushko Thermocenter, Russian Academy of Sciences, Moscow
Constant pressure heat capacity of gas
Cp,gas (J/mol*K) | Temperature (K) | Reference | Comment |
---|---|---|---|
38.98 | 50. | Thermodynamics Research Center, 1997 | p=1 bar. Thermodynamic functions calculated by [ Compton D.A.C., 1977] are larger than recommended ones up to 1.5 and 2.0 J/mol*K for Cp(T) and S(T), respectively. [ Durig J.R., 1976] have calculated thermodynamic functions for s-trans conformer. Their Cp(T) and S(T) values are lower than those of [ Thermodynamics Research Center, 1997] by 1-4 J/mol*K. |
52.61 | 100. | ||
63.77 | 150. | ||
73.94 | 200. | ||
88.79 | 273.15 | ||
93.92 | 298.15 | ||
94.30 | 300. | ||
114.29 | 400. | ||
132.18 | 500. | ||
147.54 | 600. | ||
160.64 | 700. | ||
171.8 | 800. | ||
181.5 | 900. | ||
189.8 | 1000. | ||
196.9 | 1100. | ||
203.1 | 1200. | ||
208.4 | 1300. | ||
213.0 | 1400. | ||
217.0 | 1500. |

Condensed phase thermochemistry data

Data compiled by: Eugene S. Domalski and Elizabeth D. Hearing
Constant pressure heat capacity of liquid
Cp,liquid (J/mol*K) | Temperature (K) | Reference | Comment |
---|---|---|---|
148.6 | 298.35 | Baglay, Gurariy, et al., 1988 | T = 270 to 340 K. Unsmoothed experimental datum. |
148.6 | 298.35 | Baglai, Baev, et al., 1984 | T = 273 to 343 K. Cp(liq) = -0.23229 + 0.14081T - 2.1x10-5T2 kJ/kg*K (273 to 343 K). |

Phase change data

Data compiled as indicated in comments:
BS - Robert L. Brown and Stephen E. Stein
TRC - Thermodynamics Research Center, NIST Boulder Laboratories, Chris Muzny director
AC - William E. Acree, Jr., James S. Chickos
Quantity | Value | Units | Method | Reference | Comment |
---|---|---|---|---|---|
Tboil | 377.7 | K | N/A | Weast and Grasselli, 1989 | BS |
Tboil | 375.15 | K | N/A | Henninger, 1886 | Uncertainty assigned by TRC = 2. K; TRC |
Quantity | Value | Units | Method | Reference | Comment |
Tfus | 196.55 | K | N/A | Dolliver, Gresham, et al., 1938 | Uncertainty assigned by TRC = 0.2 K; TRC |
Enthalpy of vaporization
ΔvapH (kJ/mol) | Temperature (K) | Method | Reference | Comment |
---|---|---|---|---|
36.6 ± 0.1 | 320. | EB | Steele, Chirico, et al., 2002 | Based on data from 314. to 411. K.; AC |
34.5 ± 0.2 | 360. | EB | Steele, Chirico, et al., 2002 | Based on data from 314. to 411. K.; AC |
32.1 ± 0.5 | 400. | EB | Steele, Chirico, et al., 2002 | Based on data from 314. to 411. K.; AC |

Henry's Law data

Data compiled by: Rolf Sander
Henry's Law constant (water solution)
kH(T) = k°H exp(d(ln(kH))/d(1/T) ((1/T) - 1/(298.15 K)))
k°H = Henry's law constant for solubility in water at 298.15 K (mol/(kg*bar))
d(ln(kH))/d(1/T) = Temperature dependence constant (K)
k°H (mol/(kg*bar)) | d(ln(kH))/d(1/T) (K) | Method | Reference | Comment |
---|---|---|---|---|
50. | X | N/A | ||
51. | X | N/A | Value given here as quoted by missing citation. | |
59. | 3600. | X | N/A | |
51. | M | N/A |

Gas phase ion energetics data

Data compiled by: Sharon G. Lias, Rhoda D. Levin, and Sherif A. Kafafi
Ionization energy determinations
IE (eV) | Method | Reference |
---|---|---|
9.73 | PE | Van Dam and Oskam, 1978 |

Kovats' RI, non-polar column, temperature ramp

Column type | Active phase | I | Reference | Comment |
---|---|---|---|---|
Capillary | SE-54 | 645. | Rembold, Wallner, et al., 1989 | 30. m/0.25 mm/0.25 μm, He, 0. C @ 12. min, 12. K/min; Tend: 250. C |

Van Den Dool and Kratz RI, non-polar column, temperature ramp

Column type | Active phase | I | Reference | Comment |
---|---|---|---|---|
Capillary | DB-5 | 648. | Methven L., Tsoukka M., et al., 2007 | 60. m/0.32 mm/1. μm, 40. C @ 2. min, 4. K/min, 260. C @ 10. min |
Capillary | 5 % Phenyl methyl siloxane | 624. | Estevez, Ventanas, et al., 2005 | 30. m/0.25 mm/1. μm, He, 40. C @ 10. min, 7. K/min, 250. C @ 5. min |
Capillary | HP-5 | 645. | Siegmund and Murkovic, 2004 | 30. m/0.25 mm/0.1 μm, -30. C @ 1. min, 10. K/min, 250. C @ 5. min |
Capillary | CP Sil 8 CB | 644. | Elmore, Campo, et al., 2002 | 60. m/0.25 mm/0.25 μm, He, 40. C @ 2. min, 4. K/min; Tend: 280. C |

Van Den Dool and Kratz RI, polar column, temperature ramp

Column type | Active phase | I | Reference | Comment |
---|---|---|---|---|
Capillary | HP-Innowax | 1050. | Hashizume M., Gordon M.H., et al., 2007 | 60. m/0.25 mm/0.25 μm, 40. C @ 2. min, 4. K/min, 250. C @ 10. min |
Capillary | Stabilwax | 1002. | Cros, Lignot, et al., 2005 | 60. m/0.25 mm/0.25 μm, He, 40. C @ 5. min, 3. K/min, 240. C @ 10. min |
Capillary | DB-Wax | 1046. | Nielsen, Larsen, et al., 2004 | 30. m/0.25 mm/0.25 μm, He, 45. C @ 10. min, 6. K/min, 240. C @ 30. min |
Capillary | DB-Wax | 1046. | Nielsen, Larsen, et al., 2004, 2 | 30. m/0.25 mm/0.25 μm, He, 45. C @ 10. min, 6. K/min, 240. C @ 30. min |
Capillary | DB-Wax | 1046. | Nielsen, Larsen, et al., 2004, 3 | 30. m/0.25 mm/0.25 μm, He, 45. C @ 10. min, 6. K/min, 240. C @ 30. min |
Capillary | DB-Wax | 1046. | Nielsen, Larsen, et al., 2003 | 30. m/0.25 mm/0.25 μm, He, 40. C @ 10. min, 6. K/min, 240. C @ 30. min |
Capillary | DB-Wax | 1034. | Cha, Kim, et al., 1998 | 60. m/0.25 mm/0.25 μm, 40. C @ 5. min, 3. K/min, 200. C @ 60. min |
Capillary | Supelcowax-10 | 1044. | Tanchotikul and Hsieh, 1989 | 60. m/0.25 mm/0.25 μm, 40. C @ 5. min, 2. K/min, 175. C @ 20. min |
Capillary | Supelcowax-10 | 1047. | Tanchotikul and Hsieh, 1989 | 60. m/0.25 mm/0.25 μm, 40. C @ 5. min, 2. K/min, 175. C @ 20. min |

Van Den Dool and Kratz RI, polar column, custom temperature program

Column type | Active phase | I | Reference | Comment |
---|---|---|---|---|
Capillary | CP-Wax 52CB | 1043. | Romeo, Ziino, et al., 2007 | 60. m/0.25 mm/0.25 μm, He; Program: 45C(5min) => 10C/min => 80C => 2C/min => 240C |
Capillary | Supelcowax-10 | 1036. | Baek and Cadwallader, 1996 | 60. m/0.25 mm/0.25 μm; Program: 40C => (6C/min) => 80C(6min) => (15C/min) => 200C(10min) |

Normal alkane RI, non-polar column, temperature ramp

Column type | Active phase | I | Reference | Comment |
---|---|---|---|---|
Capillary | DB-5 MS | 658. | Majcher, Lawrowski, et al., 2010 | 25. m/0.20 mm/0.33 μm, Helium, 40. C @ 1. min, 10. K/min; Tend: 250. C |
Capillary | MDN-5 | 665. | Mildner-Szkudlarz, Jelen, et al., 2003 | 30. m/0.25 mm/0.25 μm, He, 40. C @ 1. min, 20. K/min, 280. C @ 1. min |
Capillary | SPB-1 | 619. | Vichi, Pizzale, et al., 2003 | 30. m/0.25 mm/0.25 μm, He, 40. C @ 10. min, 3. K/min; Tend: 200. C |
Capillary | DB-1 | 624. | Rapior, Breheret, et al., 1997 | 30. m/0.2 mm/0.25 μm, He, 50. C @ 2. min, 4. K/min; Tend: 200. C |
Capillary | DB-5 | 657. | Macku and Shibamoto, 1991 | He, 40. C @ 5. min, 2. K/min; Column length: 60. m; Column diameter: 0.25 mm; Tend: 160. C |

Normal alkane RI, non-polar column, custom temperature program

Column type | Active phase | I | Reference | Comment |
---|---|---|---|---|
Capillary | SLB-5 MS | 615. | Mondello, 2012 | 30. m/0.25 mm/0.25 μm, Helium; Program: not specified |
Capillary | DB-5 | 639. | Miyazaki, Plotto, et al., 2011 | 60. m/0.25 mm/1.00 μm, Helium; Program: 40 0C 4 0C/min -> 230 0C 100 0C/min -> 260 0C (11.7 min) |
Capillary | HP-5 | 650. | Rotsatschakul, Visesanguan, et al., 2009 | 60. m/0.25 mm/0.25 μm, Helium; Program: 30 0C (2 min) 2 0Cmin -> 60 0C 10 0C/min -> 100 0C 20 0C/min -> 140 0C 10 0C/min -> 200 0C (10 min) |
Capillary | DB-1 | 622. | Binder, Flath, et al., 1989 | Column length: 60. m; Column diameter: 0.32 mm; Program: not specified |

Normal alkane RI, polar column, temperature ramp

Column type | Active phase | I | Reference | Comment |
---|---|---|---|---|
Capillary | FFAP | 1056. | Budryn, Nebesny, et al., 2011 | 30. m/0.32 mm/0.50 μm, Nitrogen, 35. C @ 5. min, 4. K/min, 250. C @ 45. min |
Capillary | AT-Wax | 1037. | Kiss, Csoka, et al., 2011 | 60. m/0.25 mm/0.25 μm, Helium, 4. K/min; Tstart: 60. C; Tend: 280. C |
Capillary | Supelcowax-10 | 1035. | Vichi, Castellote, et al., 2003 | 30. m/0.25 mm/0.25 μm, He, 40. C @ 10. min, 3. K/min; Tend: 200. C |
Capillary | Supelcowax-10 | 1033. | Vichi, Pizzale, et al., 2003 | 30. m/0.25 mm/0.25 μm, He, 40. C @ 10. min, 3. K/min; Tend: 200. C |
Capillary | DB-Wax | 1037. | Umano, Hagi, et al., 2000 | 60. m/0.25 mm/0.25 μm, He, 40. C @ 2. min, 2. K/min; Tend: 200. C |
Capillary | DB-Wax | 1032. | Horiuchi, Umano, et al., 1998 | 60. m/0.25 mm/1. μm, He, 3. K/min, 200. C @ 40. min; Tstart: 50. C |
Capillary | Carbowax 20M | 1012. | Kawakami and Kobayashi, 1991 | He, 60. C @ 4. min, 2. K/min; Column length: 50. m; Column diameter: 0.25 mm; Tend: 180. C |
Capillary | DB-Wax | 1034. | Binder, Flath, et al., 1989 | 50. C @ 0.1 min, 4. K/min, 230. C @ 10. min; Column length: 60. m; Column diameter: 0.32 mm |
Capillary | Supelcowax-10 | 1040. | Hsieh, Williams, et al., 1989 | 60. m/0.25 mm/0.25 μm, He, 40. C @ 5. min, 1. K/min; Tend: 175. C |

Normal alkane RI, polar column, custom temperature program

Column type | Active phase | I | Reference | Comment |
---|---|---|---|---|
Capillary | DB-Wax | 1050. | Welke, Manfroi, et al., 2012 | 30. m/0.25 mm/0.25 μm, Helium; Program: not specified |
Capillary | DB-Wax | 1084. | Miyazaki, Plotto, et al., 2011 | 60. m/0.25 mm/0.50 μm, Helium; Program: 40 0C 4 0C/min -> 230 0C 100 0C/min -> 260 0C (11.7 min) |
Capillary | DB-Wax | 1023. | Qian and Reineccius, 2003 | 60. m/0.32 mm/0.5 μm, He; Program: 35C(4min) => 2C/min => 130C => 4C/min => 250C |
Capillary | DB-Wax | 1038. | Peng, Yang, et al., 1991 | Program: not specified |
Capillary | DB-Wax | 1035. | Binder, Flath, et al., 1989 | Column length: 60. m; Column diameter: 0.32 mm; Program: not specified |
Capillary | Carbowax 400, Carbowax 20M, Carbowax 1540, Carbowax 4000, Superox 06, PEG 20M, etc. | 1044. | Waggott and Davies, 1984 | Hydrogen; Column length: 50. m; Column diameter: 0.32 mm; Program: not specified |

References

Thermodynamics Research Center, 1997
Thermodynamics Research Center,
Selected Values of Properties of Chemical Compounds., Thermodynamics Research Center, Texas A&M University, College Station, Texas, 1997. [all data]
Compton D.A.C., 1977
Compton D.A.C.,
Values for the gas-phase thermodynamic functions of conjugated compounds existing as a mixture of conformers,
J. Chem. Soc. Perkin Trans. 2, 1977, 1307-1311. [all data]
Durig J.R., 1976
Durig J.R.,
Low-frequency vibrations of crotonaldehyde,
Spectrochim. Acta, 1976, A32, 807-818. [all data]
Baglay, Gurariy, et al., 1988
Baglay, A.K.; Gurariy, L.L.; Kuleshov, G.G.,
Physical properties of compounds used in vitamin synthesis,
J. Chem. Eng. Data, 1988, 33, 512-518. [all data]
Baglai, Baev, et al., 1984
Baglai, A.K.; Baev, A.A.; Belousov, V.P.; Beregovykh, V.V.; Grushenko, M.M.; Gurarii, L.L.; Konstantinov, S.G.; Kostyushko, Yu.L.; Kuleshov, G.G.; Pasechnik, N.I.; Petrashkevich, R.I.; Podkovyrov, A.I.; Sitnov, A.A.; Shishko, M.A.; Shulgin, I.L.,
Investigation of the physico-chemical characteristics of substances utilized in the synthesis of vitamins A and E,
Khim. Farm. Zhur., 1984, 18, 1013-1019. [all data]
Weast and Grasselli, 1989
CRC Handbook of Data on Organic Compounds, 2nd Editon, Weast,R.C and Grasselli, J.G., ed(s)., CRC Press, Inc., Boca Raton, FL, 1989, 1. [all data]
Henninger, 1886
Henninger, A.,
Several Derivatives of Erythritol and Formates of Polyatomic Alcohols,
Ann. Chim. Phys., 1886, [6] 7, 209. [all data]
Dolliver, Gresham, et al., 1938
Dolliver, M.A.; Gresham, T.L.; Kistiakowsky, G.B.; Smith, E.A.; Vaughan, W.E.,
Heats of Organic Reactions VI. Heats of Hydrogenation of Some Oxygen- Containing Compounds,
J. Am. Chem. Soc., 1938, 60, 440. [all data]
Steele, Chirico, et al., 2002
Steele, W.V.; Chirico, R.D.; Cowell, A.B.; Knipmeyer, S.E.; Nguyen, A.,
Thermodynamic Properties and Ideal-Gas Enthalpies of Formation for Methyl Benzoate, Ethyl Benzoate, ( R )-(+)-Limonene, tert -Amyl Methyl Ether, trans -Crotonaldehyde, and Diethylene Glycol,
J. Chem. Eng. Data, 2002, 47, 4, 667-688, https://doi.org/10.1021/je0100847
. [all data]
Van Dam and Oskam, 1978
Van Dam, H.; Oskam, A.,
He(I) and He(II) photoelectron spectra of some substituted ethylenes,
J. Electron Spectrosc. Relat. Phenom., 1978, 13, 273. [all data]