Neodymium tetracarbide

Gas phase ion energetics data

Data compiled by: Henry M. Rosenstock, Keith Draxl, Bruce W. Steiner, and John T. Herron

Ionization energy determinations

IE (eV) Method Reference
7.6 ± 0.7EIBalducci, Capalbi, et al., 1968

References

Balducci, Capalbi, et al., 1968
Balducci, G.; Capalbi, A.; DeMaria, G.; Guido, M., Atomization energy of the NdC4 molecule, J. Chem. Phys., 1968, 48, 5275. [all data]