Butanal
- Formula: C4H8O
- Molecular weight: 72.1057
- IUPAC Standard InChIKey: ZTQSAGDEMFDKMZ-UHFFFAOYSA-N
- CAS Registry Number: 123-72-8
- Chemical structure:
View 3d structure (requires JavaScript / HTML 5) - Other names: Butyraldehyde; n-Butanal; n-Butyl aldehyde; n-Butyraldehyde; Butal; Butaldehyde; Butanaldehyde; Butyl aldehyde; Butyral; Butyric aldehyde; Butyrylaldehyde; n-C3H7CHO; Aldehyde butyrique; Aldeide butirrica; Butalyde; Butyraldehyd; NCI-C56291; UN 1129; 1-Butanal; Butan-1-al; NSC 62779

Gas phase ion energetics data

Data evaluated as indicated in comments:
HL - Edward P. Hunter and Sharon G. Lias
L - Sharon G. Lias
Data compiled as indicated in comments:
B - John E. Bartmess
LBLHLM - Sharon G. Lias, John E. Bartmess, Joel F. Liebman, John L. Holmes, Rhoda D. Levin, and W. Gary Mallard
LLK - Sharon G. Lias, Rhoda D. Levin, and Sherif A. Kafafi
RDSH - Henry M. Rosenstock, Keith Draxl, Bruce W. Steiner, and John T. Herron
Quantity | Value | Units | Method | Reference | Comment |
---|---|---|---|---|---|
IE (evaluated) | 9.82 ± 0.04 | eV | N/A | N/A | L |
Quantity | Value | Units | Method | Reference | Comment |
Proton affinity (review) | 792.7 | kJ/mol | N/A | Hunter and Lias, 1998 | HL |
Quantity | Value | Units | Method | Reference | Comment |
Gas basicity | 760.8 | kJ/mol | N/A | Hunter and Lias, 1998 | HL |
Electron affinity determinations
EA (eV) | Method | Reference | Comment |
---|---|---|---|
0.000694 | EFD | Desfrancois, Abdoul-Carime, et al., 1994 | EA: 0.7 meV. Dipole-bound state.; B |
Ionization energy determinations
IE (eV) | Method | Reference | Comment |
---|---|---|---|
9.83 | PI | Traeger and McAdoo, 1986 | LBLHLM |
9.8 | EI | McAdoo and Hudson, 1983 | LBLHLM |
9.73 ± 0.015 | EI | El-Sherbini, Allam, et al., 1981 | LLK |
9.836 ± 0.005 | PE | Hernandez, Masclet, et al., 1977 | LLK |
9.73 ± 0.03 | PE | Cocksey, Eland, et al., 1971 | LLK |
9.86 ± 0.02 | PI | Watanabe, Nakayama, et al., 1962 | RDSH |
9.85 | PE | Benoit and Harrison, 1977 | Vertical value; LLK |
9.83 | PE | Kimura, Katsumata, et al., 1975 | Vertical value; LLK |
Appearance energy determinations
Ion | AE (eV) | Other Products | Method | Reference | Comment |
---|---|---|---|---|---|
C2H3O+ | 10.19 | C2H5 | PI | Traeger and McAdoo, 1986 | LBLHLM |
C2H4O+ | 10.52 | C2H4 | EI | Holmes, Terlouw, et al., 1976 | LLK |
C3H5O+ | 10.22 | ? | EI | Mouvier and Hernandez, 1975 | LLK |
De-protonation reactions
C4H7O- + =
By formula: C4H7O- + H+ = C4H8O
Quantity | Value | Units | Method | Reference | Comment |
---|---|---|---|---|---|
ΔrH° | 1526. ± 8.8 | kJ/mol | D-EA | Alconcel, Deyerl, et al., 2001 | gas phase; B |
ΔrH° | 1523. ± 9.6 | kJ/mol | D-EA | Zimmerman, Reed, et al., 1977 | gas phase; B |
Quantity | Value | Units | Method | Reference | Comment |
ΔrG° | 1499. ± 9.6 | kJ/mol | H-TS | Alconcel, Deyerl, et al., 2001 | gas phase; B |
ΔrG° | 1496. ± 10. | kJ/mol | H-TS | Zimmerman, Reed, et al., 1977 | gas phase; B |

Gas phase thermochemistry data

Data compiled as indicated in comments:
ALS - Hussein Y. Afeefy, Joel F. Liebman, and Stephen E. Stein
DRB - Donald R. Burgess, Jr.
GT - Glushko Thermocenter, Russian Academy of Sciences, Moscow
Quantity | Value | Units | Method | Reference | Comment |
---|---|---|---|---|---|
ΔfH°gas | -50.61 ± 0.22 | kcal/mol | Cm | Wiberg, Crocker, et al., 1991 | ALS |
ΔfH°gas | -48.85 ± 0.34 | kcal/mol | Chyd | Buckley and Cox, 1967 | ALS |
ΔfH°gas | -49.40 | kcal/mol | N/A | Nicholson, 1960 | Value computed using ΔfHliquid° value of -240.3 kj/mol from Nicholson, 1960 and ΔvapH° value of 33.6 kj/mol from Wiberg, Crocker, et al., 1991.; DRB |
ΔfH°gas | -49.02 | kcal/mol | N/A | Tjebbes, 1960 | Value computed using ΔfHliquid° value of -238.7±0.7 kj/mol from Tjebbes, 1960 and ΔvapH° value of 33.6 kj/mol from Wiberg, Crocker, et al., 1991.; DRB |
Quantity | Value | Units | Method | Reference | Comment |
S°gas | 82.40 ± 1.0 | cal/mol*K | N/A | Chermin, 1961 | This value calculated from calorimetric data is close to value of 345.5(2.3) J/mol*K obtained from equilibrium measurements [ Buckley E., 1967].; GT |

Condensed phase thermochemistry data

Data compiled as indicated in comments:
ALS - Hussein Y. Afeefy, Joel F. Liebman, and Stephen E. Stein
DH - Eugene S. Domalski and Elizabeth D. Hearing
Quantity | Value | Units | Method | Reference | Comment |
---|---|---|---|---|---|
ΔfH°liquid | -58.66 ± 0.20 | kcal/mol | Cm | Wiberg, Crocker, et al., 1991 | ALS |
ΔfH°liquid | -56.90 ± 0.35 | kcal/mol | Chyd | Buckley and Cox, 1967 | ALS |
ΔfH°liquid | -57.43 | kcal/mol | Ccb | Nicholson, 1960 | ALS |
ΔfH°liquid | -57.06 ± 0.17 | kcal/mol | Ccb | Tjebbes, 1960 | ALS |
Quantity | Value | Units | Method | Reference | Comment |
ΔcH°liquid | -592.05 ± 0.34 | kcal/mol | Ccb | Nicholson, 1960 | Corresponding ΔfHºliquid = -57.41 kcal/mol (simple calculation by NIST; no Washburn corrections); ALS |
ΔcH°liquid | -592.42 ± 0.17 | kcal/mol | Ccb | Tjebbes, 1960 | Corresponding ΔfHºliquid = -57.04 kcal/mol (simple calculation by NIST; no Washburn corrections); ALS |
Quantity | Value | Units | Method | Reference | Comment |
S°liquid | 58.01 | cal/mol*K | N/A | Vasil'ev and Lebedev, 1989 | DH |
S°liquid | 59.01 | cal/mol*K | N/A | Parks, Kennedy, et al., 1956 | Extrapolation below 80 K, 43.93 J/mol*K.; DH |
Constant pressure heat capacity of liquid
Cp,liquid (cal/mol*K) | Temperature (K) | Reference | Comment |
---|---|---|---|
39.36 | 298.15 | Vasil'ev and Lebedev, 1989 | T = 11 to 330 K.; DH |
39.080 | 298.15 | Parks, Kennedy, et al., 1956 | T = 80 to 300 K.; DH |

Phase change data

Data compiled as indicated in comments:
BS - Robert L. Brown and Stephen E. Stein
TRC - Thermodynamics Research Center, NIST Boulder Laboratories, Chris Muzny director
AC - William E. Acree, Jr., James S. Chickos
DRB - Donald R. Burgess, Jr.
ALS - Hussein Y. Afeefy, Joel F. Liebman, and Stephen E. Stein
DH - Eugene S. Domalski and Elizabeth D. Hearing
Quantity | Value | Units | Method | Reference | Comment |
---|---|---|---|---|---|
Tboil | 348. ± 2. | K | AVG | N/A | Average of 31 out of 33 values; Individual data points |
Quantity | Value | Units | Method | Reference | Comment |
Tfus | 176. ± 2. | K | AVG | N/A | Average of 8 values; Individual data points |
Quantity | Value | Units | Method | Reference | Comment |
Ttriple | 176.28 | K | N/A | Vasil'ev and Lebedev, 1989, 2 | Uncertainty assigned by TRC = 0.02 K; corrected to 100 % purity by extrapolation; TRC |
Ttriple | 176.8 | K | N/A | Wilhoit, Chao, et al., 1985 | Uncertainty assigned by TRC = 0.2 K; TRC |
Ttriple | 176.8 | K | N/A | Parks, Kennedy, et al., 1956, 2 | Uncertainty assigned by TRC = 0.2 K; TRC |
Quantity | Value | Units | Method | Reference | Comment |
Tc | 537.1 | K | N/A | Anselme and Teja, 1990 | Uncertainty assigned by TRC = 4. K; TRC |
Tc | 537.2 | K | N/A | Teja and Rosenthal, 1990 | Uncertainty assigned by TRC = 0.8 K; TRC |
Quantity | Value | Units | Method | Reference | Comment |
Pc | 42.64 | atm | N/A | Teja and Rosenthal, 1990 | Uncertainty assigned by TRC = 0.987 atm; TRC |
Quantity | Value | Units | Method | Reference | Comment |
ρc | 3.88 | mol/l | N/A | Anselme and Teja, 1990 | Uncertainty assigned by TRC = 0.07 mol/l; TRC |
Quantity | Value | Units | Method | Reference | Comment |
ΔvapH° | 7.93 | kcal/mol | CGC | Chickos, Hosseini, et al., 1995 | Based on data from 313. to 353. K.; AC |
ΔvapH° | 8.03 | kcal/mol | N/A | Wiberg, Crocker, et al., 1991 | DRB |
ΔvapH° | 8.05 ± 0.1 | kcal/mol | EB | Buckley and Cox, 1967, 2 | See also Verevkin, Krasnykh, et al., 2003.; AC |
ΔvapH° | 8.1 ± 0.1 | kcal/mol | V | Buckley and Cox, 1967 | ALS |
ΔvapH° | 8.05 | kcal/mol | N/A | Buckley and Cox, 1967 | DRB |
Enthalpy of vaporization
ΔvapH (kcal/mol) | Temperature (K) | Method | Reference | Comment |
---|---|---|---|---|
8.17 | 308. | A | Stephenson and Malanowski, 1987 | Based on data from 293. to 349. K.; AC |
7.86 | 339. | EB | Wojtasinski, 1963 | Based on data from 330. to 348. K.; AC |
7.96 | 319. | N/A | Seprakova, Paulech, et al., 1959 | Based on data from 304. to 347. K. See also Boublik, Fried, et al., 1984.; AC |
8.10 | 306. | N/A | Kuchinskaya, 1938 | Based on data from 258. to 353. K.; AC |
Antoine Equation Parameters
log10(P) = A − (B / (T + C))
P = vapor pressure (atm)
T = temperature (K)
View plot Requires a JavaScript / HTML 5 canvas capable browser.
Temperature (K) | A | B | C | Reference | Comment |
---|---|---|---|---|---|
303.86 to 347.18 | 3.58541 | 952.851 | -82.569 | Seprakova, Paulech, et al., 1959, 2 | Coefficents calculated by NIST from author's data. |
Enthalpy of fusion
ΔfusH (kcal/mol) | Temperature (K) | Reference | Comment |
---|---|---|---|
2.5748 | 176.28 | Vasil'ev and Lebedev, 1989 | DH |
2.651 | 176.8 | Domalski and Hearing, 1996 | See also Vasil'ev and Lebedev, 1989, 2.; AC |
2.6539 | 176.8 | Parks, Kennedy, et al., 1956 | DH |
Entropy of fusion
ΔfusS (cal/mol*K) | Temperature (K) | Reference | Comment |
---|---|---|---|
14.61 | 176.28 | Vasil'ev and Lebedev, 1989 | DH |
15.01 | 176.8 | Parks, Kennedy, et al., 1956 | DH |
Enthalpy of phase transition
ΔHtrs (kcal/mol) | Temperature (K) | Initial Phase | Final Phase | Reference | Comment |
---|---|---|---|---|---|
0.0184 | 192.2 | liquid | liquid | Vasil'ev and Lebedev, 1989 | T = 180 to 210 K.; DH |
0.0152 | 284.8 | liquid | liquid | Vasil'ev and Lebedev, 1989 | T = 260 to 280 K.; DH |
Entropy of phase transition
ΔStrs (cal/mol*K) | Temperature (K) | Initial Phase | Final Phase | Reference | Comment |
---|---|---|---|---|---|
0.0927 | 192.2 | liquid | liquid | Vasil'ev and Lebedev, 1989 | T; DH |
0.0533 | 284.8 | liquid | liquid | Vasil'ev and Lebedev, 1989 | T; DH |

Reaction thermochemistry data

Data compiled as indicated in comments:
B - John E. Bartmess
M - Michael M. Meot-Ner (Mautner) and Sharon G. Lias
ALS - Hussein Y. Afeefy, Joel F. Liebman, and Stephen E. Stein
Individual Reactions
C4H7O- + =
By formula: C4H7O- + H+ = C4H8O
Quantity | Value | Units | Method | Reference | Comment |
---|---|---|---|---|---|
ΔrH° | 364.8 ± 2.1 | kcal/mol | D-EA | Alconcel, Deyerl, et al., 2001 | gas phase; B |
ΔrH° | 364.1 ± 2.3 | kcal/mol | D-EA | Zimmerman, Reed, et al., 1977 | gas phase; B |
Quantity | Value | Units | Method | Reference | Comment |
ΔrG° | 358.2 ± 2.3 | kcal/mol | H-TS | Alconcel, Deyerl, et al., 2001 | gas phase; B |
ΔrG° | 357.6 ± 2.5 | kcal/mol | H-TS | Zimmerman, Reed, et al., 1977 | gas phase; B |
By formula: NO- + C4H8O = (NO- • C4H8O)
Quantity | Value | Units | Method | Reference | Comment |
---|---|---|---|---|---|
ΔrH° | 39.2 | kcal/mol | ICR | Reents and Freiser, 1981 | gas phase; switching reaction,Thermochemical ladder(NO+)C2H5OH, Entropy change calculated or estimated; Farid and McMahon, 1978; M |
By formula: C6H14O2 + H2O = C4H8O + 2CH4O
Quantity | Value | Units | Method | Reference | Comment |
---|---|---|---|---|---|
ΔrH° | 8.65 ± 0.03 | kcal/mol | Cm | Wiberg, Morgan, et al., 1994 | liquid phase; ALS |
ΔrH° | 8.732 ± 0.023 | kcal/mol | Eqk | Wiberg and Squires, 1981 | liquid phase; ALS |
By formula: H2 + C4H6O = C4H8O
Quantity | Value | Units | Method | Reference | Comment |
---|---|---|---|---|---|
ΔrH° | -24.91 ± 0.10 | kcal/mol | Chyd | Dolliver, Gresham, et al., 1938 | gas phase; Reanalyzed by Cox and Pilcher, 1970, Original value = -25.2 ± 0.1 kcal/mol; At 355°K; ALS |
(CAS Reg. No. 26232-84-8 • 4294967295) +
= CAS Reg. No. 26232-84-8
By formula: (CAS Reg. No. 26232-84-8 • 4294967295C4H8O) + C4H8O = CAS Reg. No. 26232-84-8
Quantity | Value | Units | Method | Reference | Comment |
---|---|---|---|---|---|
ΔrH° | 41.8 ± 2.2 | kcal/mol | N/A | Bartmess, Scott, et al., 1979 | gas phase; value altered from reference due to change in acidity scale; B |
By formula: C4H8O + H2 = C4H10O
Quantity | Value | Units | Method | Reference | Comment |
---|---|---|---|---|---|
ΔrH° | -19.57 ± 0.18 | kcal/mol | Cm | Wiberg, Crocker, et al., 1991 | liquid phase; ALS |
ΔrH° | -16.85 ± 0.30 | kcal/mol | Chyd | Buckley and Cox, 1967 | gas phase; ALS |
By formula: Mg+ + C4H8O = (Mg+ • C4H8O)
Quantity | Value | Units | Method | Reference | Comment |
---|---|---|---|---|---|
ΔrH° | 66. ± 5. | kcal/mol | ICR | Operti, Tews, et al., 1988 | gas phase; switching reaction,Thermochemical ladder(Mg+)CH3OH; M |
By formula: C4H8O + 2CH4O = C6H14O2 + H2O
Quantity | Value | Units | Method | Reference | Comment |
---|---|---|---|---|---|
ΔrH° | -14.1 ± 0.3 | kcal/mol | Cm | Wiberg, Morgan, et al., 1994 | gas phase; ALS |
By formula: 3C4H8O = C12H24O3
Quantity | Value | Units | Method | Reference | Comment |
---|---|---|---|---|---|
ΔrH° | -7.039 | kcal/mol | Eqk | Ogorodnikov, Katsnel'son, et al., 1990 | liquid phase; PMR; ALS |

Henry's Law data

Data compiled by: Rolf Sander
Henry's Law constant (water solution)
kH(T) = k°H exp(d(ln(kH))/d(1/T) ((1/T) - 1/(298.15 K)))
k°H = Henry's law constant for solubility in water at 298.15 K (mol/(kg*bar))
d(ln(kH))/d(1/T) = Temperature dependence constant (K)
k°H (mol/(kg*bar)) | d(ln(kH))/d(1/T) (K) | Method | Reference | Comment |
---|---|---|---|---|
9.6 | 6200. | M | N/A | The data from Table 1 by missing citation was used to redo the regression analysis. The data for acetone in their Table 2 is wrong. |
5.4 | 4000. | X | N/A | |
8.6 | M | Buttery, Ling, et al., 1969 |

Ion clustering data

Data compiled by: Michael M. Meot-Ner (Mautner) and Sharon G. Lias
Clustering reactions
By formula: Mg+ + C4H8O = (Mg+ • C4H8O)
Quantity | Value | Units | Method | Reference | Comment |
---|---|---|---|---|---|
ΔrH° | 66. ± 5. | kcal/mol | ICR | Operti, Tews, et al., 1988 | gas phase; switching reaction,Thermochemical ladder(Mg+)CH3OH |
By formula: NO- + C4H8O = (NO- • C4H8O)
Quantity | Value | Units | Method | Reference | Comment |
---|---|---|---|---|---|
ΔrH° | 39.2 | kcal/mol | ICR | Reents and Freiser, 1981 | gas phase; switching reaction,Thermochemical ladder(NO+)C2H5OH, Entropy change calculated or estimated; Farid and McMahon, 1978 |

Kovats' RI, non-polar column, custom temperature program

Data compiled by: NIST Mass Spectrometry Data Center, William E. Wallace, director

Column type PackedPacked
Active phase SE-30Apiezon L
Column length (m) 6.13.0
Carrier gas HeN2
Substrate Chromasorb WGas Chrom P
Column diameter (mm)
Phase thickness (μm)
Program 150C (10min) => 15C/min => 200C(16min) => 10C/min => 240Cnot specified
I 605.594.
ReferenceMinyard, Tumlinson, et al., 1967Minyard, Tumlinson, et al., 1967
Comment MSDC-RI MSDC-RI

Kovats' RI, polar column, temperature ramp

Data compiled by: NIST Mass Spectrometry Data Center, William E. Wallace, director

Column type Capillary
Active phase DB-Wax
Column length (m) 60.
Carrier gas He
Substrate
Column diameter (mm) 0.25
Phase thickness (μm)
Tstart (C) 40.
Tend (C) 200.
Heat rate (K/min) 2.
Initial hold (min) 10.
Final hold (min)
I 867.
ReferenceUmano and Shibamoto, 1987
Comment MSDC-RI

References

Hunter and Lias, 1998
Hunter, E.P.; Lias, S.G.,
Evaluated Gas Phase Basicities and Proton Affinities of Molecules: An Update,
J. Phys. Chem. Ref. Data, 1998, 27, 3, 413-656, https://doi.org/10.1063/1.556018
. [all data]
Desfrancois, Abdoul-Carime, et al., 1994
Desfrancois, C.; Abdoul-Carime, H.; Khelifa, N.; Schermann, J.P.,
Fork 1/r to 1/r2 Potentials: Electron Exchange between Rydberg Atoms and Polar Molecules,
Phys. Rev. Lett., 1994, 73, 18, 2436, https://doi.org/10.1103/PhysRevLett.73.2436
. [all data]
Traeger and McAdoo, 1986
Traeger, J.C.; McAdoo, D.J.,
Decomposition thresholds and associated translational energy releases for eight C4H8O+ isomers,
Int. J. Mass Spectrom. Ion Processes, 1986, 68, 35. [all data]
McAdoo and Hudson, 1983
McAdoo, D.J.; Hudson, C.E.,
The decompositions of metastable [C4H8O]+ ions and the [C4H8O]+ potential surface,
Org. Mass Spectrom., 1983, 18, 466. [all data]
El-Sherbini, Allam, et al., 1981
El-Sherbini, T.M.; Allam, S.H.; Migahed, M.D.; Dawoud, A.M.,
Mass spectrometric investigation of aliphatic aldehydes,
Z. Naturforsch. A:, 1981, 36, 1334. [all data]
Hernandez, Masclet, et al., 1977
Hernandez, R.; Masclet, P.; Mouvier, G.,
Spectroscopie de photoelectrons d'aldehydes et de cetones aliphatiques,
J. Electron Spectrosc. Relat. Phenom., 1977, 10, 333. [all data]
Cocksey, Eland, et al., 1971
Cocksey, B.J.; Eland, J.H.D.; Danby, C.J.,
The effect of alkyl substitution on ionisation potential,
J. Chem. Soc., 1971, (B), 790. [all data]
Watanabe, Nakayama, et al., 1962
Watanabe, K.; Nakayama, T.; Mottl, J.,
Ionization potentials of some molecules,
J. Quant. Spectry. Radiative Transfer, 1962, 2, 369. [all data]
Benoit and Harrison, 1977
Benoit, F.M.; Harrison, A.G.,
Predictive value of proton affinity. Ionization energy correlations involving oxygenated molecules,
J. Am. Chem. Soc., 1977, 99, 3980. [all data]
Kimura, Katsumata, et al., 1975
Kimura, K.; Katsumata, S.; Yamazaki, T.; Wakabayashi, H.,
UV photoelectron spectra and sum rule consideration; out-of-plane orbitals of unsaturated compounds with planar-skeleton structure,
J. Electron Spectrosc. Relat. Phenom., 1975, 6, 41. [all data]
Holmes, Terlouw, et al., 1976
Holmes, J.L.; Terlouw, J.K.; Lossing, F.P.,
The thermochemistry of C2H4O+ ions,
J. Phys. Chem., 1976, 80, 2860. [all data]
Mouvier and Hernandez, 1975
Mouvier, G.; Hernandez, R.,
Ionisation and appearance potentials of alkylketones,
Org. Mass Spectrom., 1975, 10, 958. [all data]
Alconcel, Deyerl, et al., 2001
Alconcel, L.S.; Deyerl, H.J.; Continetti, R.E.,
Effects of alkyl substitution on the energetics of enolate anions and radicals,
J. Am. Chem. Soc., 2001, 123, 50, 12675-12681, https://doi.org/10.1021/ja0120431
. [all data]
Zimmerman, Reed, et al., 1977
Zimmerman, A.H.; Reed, K.J.; Brauman, J.I.,
Photodetachment of electrons from enolate anions. Gas phase electron affinities of enolate radicals,
J. Am. Chem. Soc., 1977, 99, 7203. [all data]