Hexanoic acid, ethyl ester
- Formula: C8H16O2
- Molecular weight: 144.2114
- IUPAC Standard InChIKey: SHZIWNPUGXLXDT-UHFFFAOYSA-N
- CAS Registry Number: 123-66-0
- Chemical structure:
View 3d structure (requires JavaScript / HTML 5) - Isotopologues:
- Other names: Ethyl caproate; Ethyl hexanoate; Caproic acid ethyl ester; n-Caproic acid ethyl ester; Acetic acid, butyl-, ethyl ester; Ethyl butyl acetate; Ethyl hexoate; Ethyl ester of hexanoic acid; Ethyl n-hexanoate; NSC 8882; 8068-81-3

Gas phase thermochemistry data

Data compiled by: Hussein Y. Afeefy, Joel F. Liebman, and Stephen E. Stein
Quantity | Value | Units | Method | Reference | Comment |
---|---|---|---|---|---|
ΔfH°gas | -528. ± 2. | kJ/mol | Cm | Wiberg and Waldron, 1991 | Heat of hydrolysis |

Condensed phase thermochemistry data

Data compiled by: Hussein Y. Afeefy, Joel F. Liebman, and Stephen E. Stein
Quantity | Value | Units | Method | Reference | Comment |
---|---|---|---|---|---|
ΔfH°liquid | -579.1 ± 1.1 | kJ/mol | Cm | Wiberg and Waldron, 1991 | Heat of hydrolysis |

Phase change data

Data compiled as indicated in comments:
BS - Robert L. Brown and Stephen E. Stein
TRC - Thermodynamics Research Center, NIST Boulder Laboratories, Chris Muzny director
AC - William E. Acree, Jr., James S. Chickos
ALS - Hussein Y. Afeefy, Joel F. Liebman, and Stephen E. Stein
DRB - Donald R. Burgess, Jr.
Quantity | Value | Units | Method | Reference | Comment |
---|---|---|---|---|---|
Tboil | 441.2 | K | N/A | Weast and Grasselli, 1989 | BS |
Tboil | 440.06 | K | N/A | Serijan and Wise, 1951 | Uncertainty assigned by TRC = 0.3 K; TRC |
Tboil | 439.8 | K | N/A | Gill and Dexter, 1934 | Uncertainty assigned by TRC = 1. K; TRC |
Tboil | 439.8 | K | N/A | Gartenmeister, 1886 | Uncertainty assigned by TRC = 1.5 K; TRC |
Tboil | 435. | K | N/A | Fehling, 1845 | Uncertainty assigned by TRC = 5. K; TRC |
Quantity | Value | Units | Method | Reference | Comment |
Tfus | 205.51 | K | N/A | Serijan and Wise, 1951 | Uncertainty assigned by TRC = 0.3 K; TRC |
Quantity | Value | Units | Method | Reference | Comment |
Tc | 615.2 | K | N/A | Young, 1994 | Uncertainty assigned by TRC = 0.6 K; TRC |
Quantity | Value | Units | Method | Reference | Comment |
ΔvapH° | 50.6 ± 0.4 | kJ/mol | GS | Verevkin and Heintz, 1999 | Based on data from 279. to 309. K.; AC |
ΔvapH° | 52. ± 1. | kJ/mol | V | Wiberg and Waldron, 1991 | Heat of hydrolysis; ALS |
ΔvapH° | 51.1 | kJ/mol | N/A | Wiberg and Waldron, 1991 | DRB |
ΔvapH° | 51.5 ± 1.3 | kJ/mol | EB | Wiberg and Waldron, 1991 | Based on data from 345. to 379. K.; AC |
ΔvapH° | 51.72 ± 0.10 | kJ/mol | C | Nilsson and Wadso, 1986 | ALS |
Enthalpy of vaporization
ΔvapH (kJ/mol) | Temperature (K) | Method | Reference | Comment |
---|---|---|---|---|
50.8 ± 0.4 | 294. | GS | Verevkin and Heintz, 1999 | Based on data from 279. to 309. K.; AC |
47.4 ± 0.3 | 359. | EB | Wiberg and Waldron, 1991 | Based on data from 345. to 374. K.; AC |
51.8 | 311. | A | Stephenson and Malanowski, 1987 | Based on data from 396. to 449. K.; AC |
48.6 | 315. | A | Stephenson and Malanowski, 1987 | Based on data from 300. to 376. K.; AC |

Gas phase ion energetics data

Data compiled by: Sharon G. Lias, Rhoda D. Levin, and Sherif A. Kafafi
Appearance energy determinations
Ion | AE (eV) | Other Products | Method | Reference | Comment |
---|---|---|---|---|---|
C4H8O2+ | 9.96 | 1-C4H8 | EI | Holmes and Lossing, 1980 |

Kovats' RI, non-polar column, isothermal

View large format table.

Column type Active phase Temperature (C) I Reference Comment
CapillaryOV-1333.982.9Hu, Lu, et al., 2006
CapillarySE-30140.979.Korhonen, 1985N2; Column length: 25. m; Column diameter: 0.33 mm
CapillarySE-30160.989.Korhonen, 1985N2; Column length: 25. m; Column diameter: 0.33 mm
CapillarySE-30180.1000.Korhonen, 1985N2; Column length: 25. m; Column diameter: 0.33 mm
CapillaryOV-10180.982.Komárek, Hornová, et al., 1982N2; Column length: 15. m; Column diameter: 0.22 mm
CapillaryOV-101200.981.Komárek, Hornová, et al., 1982N2; Column length: 15. m; Column diameter: 0.22 mm
PackedSE-30120.976.Haken, Chretien, et al., 1981Chromosorb W AW DMCS; Column length: 3.7 m
PackedSE-30150.976.Ashes and Haken, 1974Celaton (62-72 mesh); Column length: 3.7 m
PackedSE-30100.980.Chastrette, Heintz, et al., 1974N2, Chromosorb W AW (60-80 mesh); Column length: 3. m
PackedSE-30150.980.Germaine and Haken, 1969Celite 560; Column length: 3.7 m
CapillarySF-96100.986.Sakai, Maarse, et al., 1967Column length: 152. m; Column diameter: 0.8 mm

Kovats' RI, non-polar column, temperature ramp

View large format table.

Column type Active phase I Reference Comment
CapillarySE-541000.Janzanntti, Franco, et al., 20002. K/min; Column length: 50. m; Column diameter: 0.21 mm; Tstart: 80. C; Tend: 200. C
CapillaryCP Sil 5 CB983.Kaul and Vats, 19985. K/min; Column length: 25. m; Column diameter: 0.25 mm; Tstart: 60. C; Tend: 280. C
CapillaryDB-1990.Takeoka, Buttery, et al., 199260. m/0.32 mm/0.25 μm, He, 30. C @ 4. min, 2. K/min; Tend: 210. C
CapillaryDB-1986.Takeoka, Buttery, et al., 199260. m/0.32 mm/0.25 μm, He, 30. C @ 4. min, 2. K/min; Tend: 210. C
CapillaryDB-1994.Takeoka, Buttery, et al., 199260. m/0.32 mm/0.25 μm, He, 30. C @ 4. min, 2. K/min; Tend: 210. C
CapillaryDB-1991.Takeoka, Buttery, et al., 199260. m/0.32 mm/0.25 μm, He, 30. C @ 4. min, 2. K/min; Tend: 210. C
CapillaryDB-1986.Takeoka, Flath, et al., 199060. m/0.32 mm/0.25 μm, He, 30. C @ 4. min, 2. K/min; Tend: 210. C
CapillaryDB-1992.Takeoka, Flath, et al., 199060. m/0.32 mm/0.25 μm, He, 30. C @ 4. min, 2. K/min; Tend: 210. C
CapillaryDB-1986.Takeoka, Flath, et al., 199060. m/0.32 mm/0.25 μm, He, 30. C @ 4. min, 2. K/min; Tend: 210. C
CapillaryDB-1986.Takeoka, Flath, et al., 199060. m/0.32 mm/0.25 μm, He, 30. C @ 4. min, 2. K/min; Tend: 210. C
CapillaryBP-1985.Bartley and Schwede, 1989He, 30. C @ 2. min, 2. K/min; Column length: 50. m; Column diameter: 0.23 mm; Tend: 200. C
CapillaryOV-101988.Morales and Duque, 1987He, 2. K/min; Column length: 25. m; Column diameter: 0.31 mm; Tstart: 60. C; Tend: 200. C

Kovats' RI, non-polar column, custom temperature program

View large format table.

Column type Active phase I Reference Comment
CapillarySPB-1982.Riu-Aumatell, Castellari, et al., 200430. m/0.25 mm/0.25 μm; Program: not specified
CapillarySPB-1982.Riu-Aumatell, Castellari, et al., 200430. m/0.25 mm/0.25 μm; Program: not specified
CapillarySE-541000.Janzanntti, Franco, et al., 2000Column length: 50. m; Column diameter: 0.21 mm; Program: 50C (10min) => 2C/min => 75C => 3C/min => 150C => 5C/min => 200C
CapillaryDB-5MS998.Maia, Andrade, et al., 200030. m/0.25 mm/0.25 μm, He; Program: 40C => 2C/min => 60C => 4C/min => 260C
CapillaryDB-5999.Andrade, Santos, et al., 199830. m/0.25 mm/0.25 μm, He; Program: 40C => 2C/min => 60C => 4C/min => 260C
CapillarySE-30991.Brander, Kepner, et al., 1980Column length: 80. m; Column diameter: 0.29 mm; Program: not specified
CapillarySE-30991.Brander, Kepner, et al., 1980Column length: 80. m; Column diameter: 0.29 mm; Program: not specified
CapillarySE-30976.Chretien and Dubois, 1978Program: not specified

Kovats' RI, polar column, isothermal

View large format table.

Column type Active phase Temperature (C) I Reference Comment
CapillaryOV-351120.1231.Korhonen, 1985N2; Column length: 25. m; Column diameter: 0.32 mm
CapillaryOV-351140.1267.Korhonen, 1985N2; Column length: 25. m; Column diameter: 0.32 mm
CapillaryOV-351160.1220.Korhonen, 1985N2; Column length: 25. m; Column diameter: 0.32 mm
PackedCarbowax 20M100.1229.Chastrette, Heintz, et al., 1974Chromosorb WAW (60-80 mesh); Column length: 3. m
CapillaryCarbowax 20M + Igepal (20:1)75.1229.Sakai, Maarse, et al., 1967He, GAS PAK F; Column length: 152. m; Column diameter: 0.8 mm
PackedCarbowax 20M125.1226.van den Dool and Kratz, 1963Celite 545

Kovats' RI, polar column, temperature ramp

View large format table.

Column type Active phase I Reference Comment
CapillarySupelcowax1223.Riu-Aumatell, Castellari, et al., 200430. m/0.25 mm/0.25 μm, 60. C @ 5. min, 3. K/min, 240. C @ 10. min
CapillarySupelcowax1223.Riu-Aumatell, Castellari, et al., 200430. m/0.25 mm/0.25 μm, 60. C @ 5. min, 3. K/min, 240. C @ 10. min
CapillarySupelcowax-101236.Wong and Teng, 1994He, 35. C @ 5. min, 3. K/min, 200. C @ 20. min; Column length: 60. m; Column diameter: 0.25 mm
CapillaryBP-201258.Wyllie and Leach, 199070. C @ 2. min, 4. K/min; Column length: 25. m; Column diameter: 0.32 mm; Tend: 200. C
CapillaryCarbowax 20M1241.Nishimura, Yamaguchi, et al., 19892. K/min; Column length: 50. m; Column diameter: 0.22 mm; Tstart: 80. C; Tend: 200. C
CapillaryDB-Wax1246.Umano and Shibamoto, 198840. C @ 10. min, 2. K/min; Column length: 60. m; Column diameter: 0.25 mm; Tend: 220. C
CapillaryDB-Wax1241.Umano, Shoji, et al., 1986N2, 60. C @ 10. min, 2. K/min; Column length: 30. m; Column diameter: 0.25 mm; Tend: 200. C
CapillaryDB-Wax1241.Umano, Shoji, et al., 1986N2, 60. C @ 10. min, 2. K/min; Column length: 30. m; Column diameter: 0.25 mm; Tend: 200. C
CapillaryCarbowax 20M1230.Buttery, Seifert, et al., 1982He, 1. K/min; Column length: 150. m; Column diameter: 0.64 mm; Tstart: 50. C; Tend: 170. C
CapillaryCarbowax 20M1213.Toda, Yamaguchi, et al., 19822. K/min; Column length: 50. m; Column diameter: 0.28 mm; Tstart: 80. C; Tend: 200. C
CapillaryCarbowax 20M1216.Toda, Yamaguchi, et al., 19822. K/min; Column length: 50. m; Column diameter: 0.28 mm; Tstart: 80. C; Tend: 200. C
CapillaryCarbowax 20M1232.Tressl, Friese, et al., 1978He, 2. K/min; Column length: 50. m; Column diameter: 0.28 mm; Tstart: 70. C; Tend: 190. C

Kovats' RI, polar column, custom temperature program

View large format table.

Column type Active phase I Reference Comment
CapillaryDB-Wax1220.Rezende and Fraga, 200330. m/0.25 mm/0.25 μm, He; Program: 40C(5min) => 5C/min => 150C => 8C/min => 240C(25min)
CapillaryCarbowax 20M1222.Garruti, Franco, et al., 2001H2; Column length: 30. m; Column diameter: 0.25 mm; Program: 50 0C (8 min) 4 K/min -> 110 0C 16 K/min -> 200 0C
CapillaryCarbowax 20M1241.Brander, Kepner, et al., 1980Program: not specified
CapillaryCarbowax 20M1244.Brander, Kepner, et al., 1980Program: not specified

Van Den Dool and Kratz RI, non-polar column, temperature ramp

View large format table.

Column type Active phase I Reference Comment
CapillaryDB-5999.Baccouri, Ben Temime, et al., 200730. m/0.25 mm/0.25 μm, He, 3. K/min; Tstart: 60. C; Tend: 240. C
CapillarySPB-51000.Balbontin, Gaete-Eastman, et al., 200730. m/0.25 mm/0.25 μm, He, 50. C @ 2. min, 20. K/min, 220. C @ 2. min
CapillarySPB-5997.Engel and Ratel, 200760. m/0.32 mm/1. μm, 40. C @ 2. min, 3. K/min, 230. C @ 10. min
Capillary5 % Phenyl methyl siloxane996.Campo, Ferreira, et al., 2006He, 60. C @ 6. min, 4. K/min; Column length: 30. m; Column diameter: 0.53 mm; Tend: 230. C
CapillaryCP Sil 5 CB976.Kafkas, Cabaroglu, et al., 200625. m/0.25 mm/0.4 μm, He, 5. K/min, 260. C @ 20. min; Tstart: 60. C
CapillaryDB-5MS996.Whetstine M.E.C., Drake M.A., et al., 200630. m/0.25 mm/0.25 μm, He, 40. C @ 5. min, 5. K/min, 200. C @ 45. min
Capillary5 % Phenyl methyl siloxane1010.Estevez, Ventanas, et al., 200530. m/0.25 mm/1. μm, He, 40. C @ 10. min, 7. K/min, 250. C @ 5. min
CapillaryDB-51000.Fang and Qian, 200530. m/0.32 mm/1. μm, N2, 40. C @ 2. min, 4. K/min, 230. C @ 10. min
CapillaryHP-51000.Mahattanatawee, Goodner, et al., 200530. m/0.25 mm/0.25 μm, He, 50. C @ 5. min, 4. K/min, 250. C @ 15. min
CapillaryHP-51002.Mahattanatawee, Goodner, et al., 200530. m/0.25 mm/0.25 μm, He, 50. C @ 5. min, 4. K/min, 250. C @ 15. min
CapillaryHP-5MS996.Pino, Mesa, et al., 200530. m/0.25 mm/0.25 μm, He, 60. C @ 2. min, 4. K/min, 250. C @ 20. min
CapillaryDB-5MS996.Whetstine, Cadwallader, et al., 200530. m/0.25 mm/0.25 μm, 40. C @ 3. min, 10. K/min, 200. C @ 20. min
CapillaryDB-51000.Avsar, Karagul-Yuceer, et al., 200430. m/0.25 mm/0.25 μm, 40. C @ 5. min, 10. K/min, 200. C @ 15. min
CapillaryDB-51000.Avsar, Karagul-Yuceer, et al., 200430. m/0.25 mm/0.25 μm, 40. C @ 5. min, 10. K/min, 200. C @ 15. min
CapillaryZB-5995.Gocmen, Gurbuz, et al., 20040. m/0.32 mm/0.5 μm, 7. K/min, 265. C @ 5. min; Tstart: 40. C
CapillaryCP-Sil 8CB-MS997.Hierro, de la Hoz, et al., 200460. m/0.25 mm/0.25 μm, 40. C @ 2. min, 4. K/min, 280. C @ 5. min
CapillaryHP-51000.Siegmund, Derler, et al., 200430. m/0.25 mm/1. μm, -30. C @ 1. min, 10. K/min; Tend: 250. C
CapillaryDB-1980.Brat, Rega, et al., 200330. m/0.25 mm/0.25 μm, He, 3. K/min, 250. C @ 20. min; Tstart: 40. C
CapillaryUltra-21001.Ceva-Antunes, Bizzo, et al., 200325. m/0.25 mm/0.33 μm, H2, 40. C @ 2. min, 3. K/min, 280. C @ 10. min
CapillaryHP-5999.Emilio Tomei, Manganelli, et al., 200330. m/0.25 mm/0.25 μm, N2, 60. C @ 10. min, 5. K/min; Tend: 220. C
CapillaryCP Sil 5 CB981.Pino, Almora, et al., 200360. m/0.32 mm/0.25 μm, He, 60. C @ 10. min, 3. K/min, 280. C @ 60. min
CapillarySPB-5996.Pino, Marbot, et al., 200230. m/0.25 mm/0.25 μm, He, 60. C @ 2. min, 4. K/min, 250. C @ 20. min
CapillaryCP-Sil 8CB-MS1003.Bruna, Hierro, et al., 200160. m/0.25 mm/0.25 μm, 40. C @ 2. min, 4. K/min; Tend: 280. C
CapillarySPB-1979.Larráyoz, Addis, et al., 200130. m/0.32 mm/4. μm, He, 45. C @ 13. min, 5. K/min, 240. C @ 5. min
CapillaryDB-5997.Nogueira, Bittrich, et al., 200130. m/0.25 mm/0.25 μm, H2, 3. K/min; Tstart: 60. C; Tend: 240. C
CapillaryCP Sil 5 CB981.Pino and Marbot, 200150. m/0.32 mm/0.4 μm, He, 60. C @ 10. min, 3. K/min, 280. C @ 60. min
CapillaryCP Sil 5 CB981.Pino, Marbot, et al., 200150. m/0.32 mm/0.4 μm, He, 60. C @ 10. min, 3. K/min, 280. C @ 60. min
CapillaryHP-51014.Shalit, Katzir, et al., 2001He, 50. C @ 1. min, 4. K/min; Column length: 30. m; Column diameter: 0.25 mm; Tend: 200. C
CapillaryHP-51000.0Siegmund, Derler, et al., 200130. m/0.25 mm/0.25 μm, He, 5.3 K/min, 280. C @ 5. min; Tstart: 35. C
CapillaryDB-1985.Brat, Brillouet, et al., 200030. m/0.32 mm/0.25 μm, H2, 40. C @ 3. min, 3. K/min, 245. C @ 20. min
CapillaryDB-51002.Moio, Piombino, et al., 200030. m/0.32 mm/1. μm, H2, 3. K/min; Tstart: 40. C; Tend: 210. C
CapillaryDB-51003.Moio, Piombino, et al., 200030. m/0.32 mm/1. μm, H2, 3. K/min; Tstart: 40. C; Tend: 210. C
CapillaryDB-51005.Moio, Piombino, et al., 200030. m/0.32 mm/1. μm, H2, 3. K/min; Tstart: 40. C; Tend: 210. C
CapillarySPB-5996.Verdier-Metz., Coulon, et al., 199860. m/0.32 mm/1. μm, He, 40. C @ 5. min, 3. K/min, 200. C @ 2. min
CapillaryDB-51002.Moio and Addeo, 199830. m/0.32 mm/1. μm, H2, 3. K/min; Tstart: 40. C; Tend: 210. C
CapillaryDB-51003.Moio and Addeo, 199830. m/0.32 mm/1. μm, H2, 3. K/min; Tstart: 40. C; Tend: 210. C
CapillaryDB-51003.Moio and Addeo, 199830. m/0.32 mm/1. μm, H2, 3. K/min; Tstart: 40. C; Tend: 210. C
CapillaryDB-1979.Bartelt, 199730. m/0.32 mm/5. μm, He, 35. C @ 1. min, 10. K/min; Tend: 270. C
CapillaryDB-51002.Moio L., Rillo L., et al., 199630. m/0.32 mm/1. μm, H2, 3. K/min; Tstart: 40. C; Tend: 220. C
CapillaryDB-51003.Moio L., Rillo L., et al., 199630. m/0.32 mm/1. μm, H2, 3. K/min; Tstart: 40. C; Tend: 220. C
CapillaryDB-51003.Moio L., Rillo L., et al., 199630. m/0.32 mm/1. μm, H2, 3. K/min; Tstart: 40. C; Tend: 220. C
CapillaryOV-101980.Chisholm, Guiher, et al., 199435. C @ 3. min, 6. K/min; Column length: 15. m; Column diameter: 0.32 mm; Tend: 250. C
CapillarySE-30980.de Frutos, Sanz, et al., 199122. m/0.30 mm/1.0 μm, N2, 2. K/min; Tstart: 60. C; Tend: 250. C
CapillaryDB-11011.Wu, Kuo, et al., 199150. m/0.32 mm/1.05 μm, He, 2. K/min, 260. C @ 40. min; Tstart: 40. C
CapillaryDB-51000.Guichard and Souty, 1988H2, 30. C @ 5. min, 1.5 K/min; Column length: 0.32 m; Column diameter: 1. mm; Tend: 180. C
CapillarySE-30993.Korhonen, 1985N2, 6. K/min; Column length: 25. m; Column diameter: 0.33 mm; Tstart: 100. C; Tend: 320. C
PackedSE-30979.van den Dool and Kratz, 1963Celite; Tstart: 75. C; Tend: 228. C

Van Den Dool and Kratz RI, non-polar column, custom temperature program

View large format table.

Column type Active phase I Reference Comment
CapillaryHP-5MS998.4Andriamaharavo, 201430. m/0.25 mm/0.25 μm, He; Program: 60C (1 min) => 5 C/min => 210C => 10 C/min => 280C (15 min)
CapillaryVF-5MS998.Tretyakov, 201130. m/0.25 mm/0.25 μm, He; Program: Multi-step temperature program; T(initial)=60C; T(final)=270C
CapillaryBPX-51001.Dharmawan, Kasapis, et al., 200730. m/0.25 mm/0.25 μm, He; Program: 35C => 4C/min => 200C => 30C/min => 300C (3min)
CapillaryDB-5996.Escudero, Campo, et al., 2007Program: not specified
CapillaryVF-5MS994.Carasek and Pawliszyn, 200630. m/0.25 mm/0.25 μm, He; Program: 40C(2min) => 5C/min => 200C (2min) => 30C/min => 260C
CapillaryVF-5MS994.Carasek and Pawliszyn, 200630. m/0.25 mm/0.25 μm, He; Program: 40C(2min) => 5C/min => 200C (2min) => 30C/min => 260C
CapillaryHP-5MS998.Bonaiti, Irlinger, et al., 200530. m/0.25 mm/0.25 μm, He; Program: 5C(8min) => 3C/min => 20C => 10C/min => 150C(10min)
CapillaryDB-5996.Campo, Ferreira, et al., 2005Program: not specified
CapillarySE-541000.Fritsch and Schieberle, 200530. m/0.32 mm/0.25 μm, He; Program: 35C(2min) => 40C/min => 50C(2min) => 6C/min => 180C => 20C/min => 230C(10min)
CapillarySE-541000.Fritsch and Schieberle, 200530. m/0.32 mm/0.25 μm, He; Program: 35C(2min) => 40C/min => 50C(2min) => 6C/min => 180C => 20C/min => 230C(10min)
CapillaryDB-51001.Wang, Finn, et al., 200530. m/0.32 mm/1. μm, He; Program: 40C(2min) => 5C/min => 100C => 4C/min => 230C (10min)
CapillaryDB-51003.Wang, Finn, et al., 200530. m/0.32 mm/1. μm, He; Program: 40C(2min) => 5C/min => 100C => 4C/min => 230C (10min)
CapillaryDB-51006.Klesk, Qian, et al., 200430. m/0.32 mm/1. μm, He; Program: 40C (2min) => 5C/min => 100C => 4C/min => 230C (10min)
CapillaryDB-51001.Boscaini, van Ruth, et al., 200360. m/0.32 mm/1. μm, He; Program: 40C(4min) => 2C/min => 90C => 4C/min => 130C 8C/min => 250C
CapillaryDB-51002.Klesk and Qian, 200330. m/0.25 mm/0.25 μm, He; Program: 40C(2min) => 5C/min => 100C => 4C/min => 230C(10min)
CapillaryDB-5992.Klesk and Qian, 2003, 230. m/0.32 mm/1. μm, He; Program: 40C(2min) => 2C/min => 100C => 10C/min => 230C (5min)
CapillaryDB-5996.Mayr, van Ruth, et al., 200360. m/0.32 mm/1. μm, He; Program: 40 C(4min) => 2C/min => 90C => 4C/min => 130C => 8C/min => 250C
CapillaryDB-5995.Passos X.S., Castro A.C.M., et al., 200330. m/0.25 mm/0.25 μm, He; Program: 60C(2min) => 3C/min => 240C => 10C/min => 270C (4.5min)
CapillaryHP-51001.Engel, Baty, et al., 200230. m/0.25 mm/0.25 μm, He; Program: 5C(5min) => 3C/min => 20C => 5C/min => 100C 15C/min => 150C (5min)
CapillaryDB-5998.Zehentbauer and Reineccius, 200230. m/0.25 mm/0.25 μm, He; Program: 35 C (2 min) 40 C/min -> 50 C (2 min) 4 C/min -> 230 C
CapillaryDB-5999.Beaulieu and Grimm, 200130. m/0.25 mm/0.25 μm, He; Program: 50C (1min) => 5C/min => 100C => 10C/min => 250C (9min)
CapillaryDB-5MS989.Boulanger and Crouzet, 200130. m/0.25 mm/0.25 μm, H2; Program: 40C (5min) => 2C/min => 200C => 5C/min => 250C (15min)
CapillaryHP-5998.Isidorov, Krajewska, et al., 200130. m/0.25 mm/0.25 μm, He; Program: 50C => 6C/min => 100C => 4C/min => 280C
CapillaryDB-5MS997.Boulanger and Crouzet, 200030. m/0.25 mm/0.25 μm, He; Program: 60 0C (3 min) 2 K/min -> 220 0C 5 K/min -> 250 0C (15 min)
CapillaryDB-51003.Boulanger, Chassagne, et al., 199930. m/0.25 mm/0.25 μm, H2; Program: 40C(5min) => 2C/min => 220C => 5C/min => 250C(15min)
CapillaryDB-5996.Boulanger, Chassagne, et al., 199930. m/0.25 mm/0.25 μm, H2; Program: 40C(5min) => 2C/min => 220C => 5C/min => 250C(15min)
CapillarySE-541002.Buettner and Schieberle, 199930. m/0.32 mm/0.25 μm, He; Program: 35C (2min) => 40C/min => 50C (2min) => 6C/min => 180C => 10C/min => 230C (10min)
CapillaryBPX-5999.Bauchot, Mottram, et al., 199850. m/0.32 mm/0.50 μm, He; Program: 0 0C (8 min) -> (1 min) -> 50 0C (2 min) 2.5 0C/min -> 100 0C 6 0C/min -> 250 0C
CapillarySE-541002.Hinterholzer and Schieberie, 199830. m/0.32 mm/0.25 μm, He; Program: 35C(2min) => 40C/min => 50C(2min) => 6C/min => 180C => 10C/min => 230C(10min)
CapillarySE-541002.Kubícková and Grosch, 1997Column length: 30. m; Column diameter: 0.32 mm; Program: 35C (2min) => 40C/min => 50C (2min) => 4C/min => 250C (10min)
CapillarySE-541005.Kubícková and Grosch, 1997Column length: 30. m; Column diameter: 0.32 mm; Program: 35C (2min) => 40C/min => 50C (2min) => 4C/min => 250C (10min)
CapillarySE-52998.Mondello, Dugo, et al., 199560. m/0.32 mm/0.40 μm, He; Program: 45 C (6 min) 3 C/min -> 111 0C 2 C/min -> 160 C 3 C/min -> 300 C (15 min)
PackedSE-30982.Peng, Ding, et al., 1988Supelcoport; Chromosorb; Column length: 3.05 m; Program: 40C(5min) => 10C/min => 200C or 250C (60min)

Van Den Dool and Kratz RI, polar column, temperature ramp

View large format table.

Column type Active phase I Reference Comment
CapillaryDB-Wax1232.Botelho, Caldeira, et al., 200730. m/0.25 mm/0.25 μm, He, 50. C @ 2. min, 3.5 K/min, 180. C @ 25. min
CapillaryInnowax1244.Botelho, Caldeira, et al., 200730. m/0.25 mm/0.25 μm, H2, 45. C @ 5. min, 3.5 K/min, 210. C @ 20. min
CapillaryDB-Wax1240.Pozo-Bayon M.A., Ruiz-Rodriguez A., et al., 200730. m/0.25 mm/0.5 μm, He, 40. C @ 5. min, 4. K/min, 250. C @ 15. min
CapillaryDB-Wax1240.Pozo-Bayon M.A., Ruiz-Rodriguez A., et al., 200730. m/0.25 mm/0.5 μm, He, 40. C @ 5. min, 4. K/min, 250. C @ 15. min
CapillaryDB-Wax1240.Pozo-Bayon M.A., Ruiz-Rodriguez A., et al., 200730. m/0.25 mm/0.5 μm, He, 40. C @ 5. min, 4. K/min, 250. C @ 15. min
CapillarySupelcowax-101246.Arena, Guarrera, et al., 200630. m/0.32 mm/0.5 μm, He, 70. C @ 7. min, 4. K/min, 220. C @ 20. min
CapillaryDB-Wax Etr1236.Aubert C. and Pitrat M., 200630. m/0.25 mm/0.25 μm, He, 40. C @ 3. min, 5. K/min, 250. C @ 15. min
CapillaryAT-Wax1248.Campo, Ferreira, et al., 2006H2, 40. C @ 5. min, 3. K/min; Column length: 30. m; Column diameter: 0.53 mm; Tend: 230. C
CapillaryDB-Wax1239.Gurbuz O., Rouseff J.M., et al., 200660. m/0.25 mm/0.25 μm, He, 7. K/min, 265. C @ 5. min; Tstart: 40. C
CapillaryDB-Wax1237.Gurbuz O., Rouseff J.M., et al., 200630. m/0.32 mm/0.5 μm, He, 7. K/min, 265. C @ 5. min; Tstart: 40. C
CapillaryCP-Wax 52CB1236.Kourkoutas, Elmore, et al., 200660. m/0.25 mm/0.25 μm, He, 4. K/min; Tstart: 40. C; Tend: 250. C
CapillaryInnowax1230.Lee, Lee, et al., 200660. m/0.25 mm/0.25 μm, He, 40. C @ 4. min, 4. K/min, 230. C @ 20. min
CapillaryDB-Wax1227.Osorio, Alarcon, et al., 200630. m/0.25 mm/0.25 μm, He, 50. C @ 4. min, 4. K/min, 220. C @ 20. min
CapillaryDB-Wax1247.Petka, Ferreira, et al., 200630. m/0.32 mm/0.5 μm, 40. C @ 3. min, 5. K/min, 200. C @ 8. min
CapillaryLM-1201253.Pinto, Guedes, et al., 200650. m/0.25 mm/0.5 μm, 3. K/min, 240. C @ 30. min; Tstart: 50. C
CapillaryDB-Wax1221.Whetstine M.E.C., Drake M.A., et al., 200630. m/0.25 mm/0.25 μm, He, 40. C @ 3. min, 10. K/min, 200. C @ 20. min
CapillaryOV-3511224.Bonvehí, 200550. m/0.32 mm/0.2 μm, He, 5. K/min; Tstart: 60. C; Tend: 220. C
CapillaryStabilwax1242.Fang and Qian, 200530. m/0.32 mm/1. μm, N2, 40. C @ 2. min, 4. K/min, 230. C @ 10. min
CapillaryDB-Wax1258.Malliaa, Fernandez-Garcia, et al., 200560. m/0.32 mm/1. μm, He, 45. C @ 1. min, 5. K/min, 250. C @ 12. min
CapillaryDB-Wax1267.Malliaa, Fernandez-Garcia, et al., 200560. m/0.32 mm/1. μm, He, 45. C @ 1. min, 5. K/min, 250. C @ 12. min
CapillaryInnowax1231.Pena, Barciela, et al., 200530. m/0.25 mm/0.25 μm, He, 40. C @ 5. min, 5. K/min, 200. C @ 2. min
CapillarySupelcowax-101245.Riu-Aumatell, Lopez-Tamames, et al., 200530. m/0.25 mm/0.25 μm, He, 60. C @ 5. min, 3. K/min, 240. C @ 10. min
CapillaryDB-Wax1221.Whetstine, Cadwallader, et al., 200530. m/0.25 mm/0.25 μm, 40. C @ 3. min, 10. K/min, 200. C @ 20. min
CapillaryDB-Wax1232.Aubert and Bourger, 200430. m/0.25 mm/0.25 μm, H2, 40. C @ 3. min, 3. K/min, 250. C @ 20. min
CapillaryDB-Wax1224.Avsar, Karagul-Yuceer, et al., 200430. m/0.25 mm/0.25 μm, 40. C @ 5. min, 10. K/min, 200. C @ 15. min
CapillaryDB-FFAP1244.Avsar, Karagul-Yuceer, et al., 200415. m/0.32 mm/0.25 μm, He, 35. C @ 5. min, 10. K/min, 225. C @ 15. min
CapillaryDB-Wax1224.Avsar, Karagul-Yuceer, et al., 200430. m/0.25 mm/0.25 μm, 40. C @ 5. min, 10. K/min, 200. C @ 15. min
CapillaryDB-FFAP1232.Avsar, Karagul-Yuceer, et al., 200415. m/0.32 mm/0.25 μm, He, 35. C @ 5. min, 10. K/min, 225. C @ 15. min
CapillaryCP-Wax 52CB1233.Ferrari, Lablanquie, et al., 200430. m/0.25 mm/0.2 μm, He, 80. C @ 4. min, 10. K/min; Tend: 240. C
CapillaryZB-Wax1226.Ledauphin, Saint-Clair, et al., 200430. m/0.25 mm/0.15 μm, He, 35. C @ 10. min, 1.8 K/min, 220. C @ 10. min
CapillaryDB-Wax1241.Rega, Fournier, et al., 200430. m/0.32 mm/0.5 μm, He, 40. C @ 5. min, 5. K/min; Tend: 240. C
CapillaryDB-Wax1223.Varming, Andersen, et al., 200430. m/0.25 mm/0.25 μm, He, 40. C @ 10. min, 6. K/min, 240. C @ 25. min
CapillaryDB-Wax1229.Varming, Petersen, et al., 200430. m/0.25 mm/0.25 μm, He, 40. C @ 10. min, 6. K/min, 240. C @ 25. min
CapillaryDB-Wax1212.Brat, Rega, et al., 200330. m/0.25 mm/0.25 μm, He, 3. K/min, 250. C @ 20. min; Tstart: 40. C
CapillaryHP-Wax1229.Emilio Tomei, Manganelli, et al., 200330. m/0.25 mm/0.25 μm, N2, 60. C @ 10. min, 5. K/min; Tend: 220. C
CapillaryDB-Wax1233.Hayata, Sakamoto, et al., 2003He, 40. C @ 10. min, 3. K/min, 220. C @ 30. min; Column length: 60. m; Column diameter: 0.25 mm
CapillaryAT-Wax1222.Pino, Almora, et al., 200360. m/0.32 mm/0.25 μm, He, 65. C @ 10. min, 2. K/min, 250. C @ 60. min
CapillaryDB-Wax1241.Rega, Fournier, et al., 200330. m/0.32 mm/0.5 μm, 35. C @ 5. min, 5. K/min, 240. C @ 5. min
CapillaryAT-Wax1225.Pino, Marbot, et al., 2002, 260. m/0.32 mm/0.25 μm, He, 65. C @ 10. min, 2. K/min, 250. C @ 60. min
CapillaryCP-Wax 52CB1271.Liu, Yang, et al., 2001H2, 2. K/min; Column length: 50. m; Column diameter: 0.32 mm; Tstart: 50. C; Tend: 200. C
CapillaryDB-Wax1241.2Pet'ka, Mocák, et al., 200130. m/0.32 mm/0.25 μm, H2, 35. C @ 0.5 min, 4. K/min; Tend: 220. C
CapillaryAT-Wax1224.Pino and Marbot, 200160. m/0.32 mm/0.25 μm, He, 65. C @ 10. min, 2. K/min, 250. C @ 60. min
CapillaryAT-Wax1225.Pino, Marbot, et al., 200160. m/0.32 mm/0.25 μm, He, 65. C @ 10. min, 2. K/min, 250. C @ 60. min
CapillaryDB-Wax1240.0Siegmund, Derler, et al., 200130. m/0.32 mm/0.5 μm, He, 1.1 K/min, 250. C @ 10. min; Tstart: 35. C
CapillarySupelcowax-101238.Chung, 200060. m/0.25 mm/0.25 μm, He, 2. K/min, 195. C @ 90. min; Tstart: 35. C
CapillarySupelcowax-101238.Chung, 199960. m/0.25 mm/0.25 μm, He, 35. C @ 5. min, 2. K/min, 195. C @ 90. min
CapillaryDB-Wax1228.Cha, Kim, et al., 199860. m/0.25 mm/0.25 μm, 40. C @ 5. min, 3. K/min, 200. C @ 60. min
CapillaryCarbowax 20M1230.Mondello, Dugo, et al., 199560. m/0.32 mm/0.425 μm, He, 45. C @ 3. min, 3. K/min, 300. C @ 20. min
CapillaryDB-Wax1238.Sumitani, Suekane, et al., 1994He, 40. C @ 5. min, 3. K/min; Column length: 60. m; Column diameter: 0.25 mm; Tend: 200. C
CapillaryDB-Wax1237.Stashenko, Macku, et al., 1992He, 35. C @ 5. min, 3. K/min; Column length: 60. m; Column diameter: 0.25 mm; Tend: 180. C
CapillaryCarbowax 20M1220.Suárez and Duque, 199225. m/0.31 mm/0.3 μm, 2. K/min; Tstart: 50. C; Tend: 200. C
CapillaryDB-Wax1230.Umano, Hagi, et al., 1992He, 40. C @ 10. min, 2. K/min; Column length: 30. m; Column diameter: 0.25 mm; Tend: 200. C
CapillaryCarbowax 20M1220.Suárez and Duque, 19912. K/min; Column length: 25. m; Column diameter: 0.31 mm; Tstart: 50. C; Tend: 200. C
CapillaryCarbowax 20M1223.Suárez and Duque, 19912. K/min; Column length: 25. m; Column diameter: 0.31 mm; Tstart: 50. C; Tend: 200. C
CapillaryOV-3511261.Korhonen, 1985N2, 6. K/min; Column length: 25. m; Column diameter: 0.32 mm; Tstart: 100. C; Tend: 230. C
CapillaryCarbowax 20M1224.Chen, Kuo, et al., 1982He, 50. C @ 10. min, 1. K/min; Tend: 160. C
PackedCarbowax 20M1228.van den Dool and Kratz, 1963Celite 545, 4.6 K/min; Tstart: 75. C; Tend: 228. C

Van Den Dool and Kratz RI, polar column, custom temperature program

View large format table.

Column type Active phase I Reference Comment
CapillarySupelcowax-101238.Bianchi, Careri, et al., 200730. m/0.25 mm/0.25 μm, He; Program: 35C(8min) => 4C/min => 60C => 6C/min => 160C => 20C/min => 200C(1min)
CapillarySupelcowax-101242.Bianchi, Careri, et al., 200730. m/0.25 mm/0.25 μm, He; Program: 35C(8min) => 4C/min => 60C => 6C/min => 160C => 20C/min => 200C(1min)
CapillaryDB-Wax1251.Escudero, Campo, et al., 200730. m/0.32 mm/0.5 μm, H2; Program: 40C(5min) => 4C/min => 100C6C/min => 136C => 3C/min => 220C (10min)
CapillaryDB-Wax1234.Mehinagic, Royer, et al., 200630. m/0.25 mm/0.5 μm, He; Program: 40C => 5C/min => 60C(30min) => 5C/min => 240C
CapillaryDB-Wax1230.Selli, Canbas, et al., 200630. m/0.32 mm/0.5 μm, H2; Program: 60C(3min) => 2C/min => 220C => 3C/min => 245C (20min)
CapillaryDB-Wax1230.Selli, Canbas, et al., 2006, 230. m/0.32 mm/0.5 μm, H2; Program: 60C(3min) => 2C/min => 220C => 3C/min => 245C(20min)
CapillarySOLGel-Wax1220.Aubert, Baumann, et al., 200530. m/0.25 mm/0.25 μm, He; Program: 35C(5min) => 3C/min => 150C => 5C/min => 250C(10 min)
CapillarySOLGel-Wax1220.Aubert, Baumann, et al., 200530. m/0.25 mm/0.25 μm, He; Program: 35C(5min) => 3C/min => 150C => 5C/min => 250C (10min)
CapillaryDB-Wax1248.Campo, Ferreira, et al., 200530. m/0.32 mm/0.5 μm, H2; Program: 40C(5min) => 4C/min => 100C => 6C/min => 200C
CapillaryFFAP1235.Fritsch and Schieberle, 200530. m/0.32 mm/0.25 μm, He; Program: 35C(2min) => 40C/min => 60C(2min) => 6C/min => 180C => 20C/min => 230C(10min)
CapillarySupelcowax-101235.Howard, Mike, et al., 200530. m/0.25 mm/0.25 μm, He; Program: 35C(8min) => 3C/min => 134C => 20C/min => 250C(3.2min)
CapillaryCP-Wax 52CB1220.Kaack, Christensen, et al., 200550. m/0.25 mm/0.2 μm, He; Program: 33C(1.5min) => 1.5C/min => 60C(4min) => 2C/min => 100C => 8C/min => 220C(15min)
CapillaryStabilwax1240.Wang, Finn, et al., 200530. m/0.32 mm/1. μm, He; Program: 40C(2min) => 5C/min => 100C => 4C/min => 230C (10min)
CapillaryStabilwax1258.Wang, Finn, et al., 200530. m/0.32 mm/1. μm, He; Program: 40C(2min) => 5C/min => 100C => 4C/min => 230C (10min)
CapillaryDB-Wax1223.Ferrari, Lablanquie, et al., 200460. m/0.25 mm/0.25 μm, He; Program: 35C(0.7min) => 20C/min => 70C => 4C/min => 240C
CapillaryStabilwax1251.Klesk, Qian, et al., 200430. m/0.32 mm/1. μm, He; Program: 40C (2min) => 5C/min => 100C => 4C/min => 230C (10min)
CapillaryDB-Wax1230.Selli, Cabaroglu, et al., 200430. m/0.32 mm/0.5 μm, H2; Program: 60C(3min) => 2C/min => 220C => 3C/min => 245C (20min)
CapillaryCP-Wax 52CB1230.Verzera, Ziino, et al., 200460. m/0.25 mm/0.25 μm, He; Program: 45C(5min) => 10C/min => 80C => 2C/min => 240C
CapillaryCarbowax 20M1237.Boido, Lloret, et al., 200325. m/0.32 mm/0.25 μm, H2; Program: 40C (8min) => 3C/min => 180C => 20C/min => 230C
CapillaryStabilwax1251.Klesk and Qian, 200330. m/0.32 mm/1. μm, He; Program: 40C(2min) => 5C/min => 100C => 4C/min => 230C(10min)
CapillaryDB-Wax1240.Klesk and Qian, 2003, 230. m/0.25 mm/0.5 μm, He; Program: 40C(2min) => 2C/min => 100C => 10C/min => 230C (5min)
CapillarySupelcowax-101240.da Porto, Pizzale, et al., 200330. m/0.32 mm/0.3 μm; Program: 60C(8min) => 8C/min => 170C => 13C/min => 240C(20min)
CapillaryDB-Wax1230.Nurgel, Erten, et al., 200230. m/0.32 mm/0.5 μm, H2; Program: 60C (3min) => 2C/min => 220C => 3C/min => 245C (20min)
CapillaryDB-Wax1212.Boulanger and Crouzet, 200130. m/0.25 mm/0.25 μm, H2; Program: 60C (3min) => 2C/min => 220C => 5C/min => 250C (15min)
CapillaryInnowax1249.Larráyoz, Addis, et al., 200160. m/0.22 mm/0.25 μm, He; Program: 35C (1min) => 3C/min => 170C => 4C/min => 200C (20min)
CapillaryDB-Wax1205.Boulanger and Crouzet, 200030. m/0.25 mm/0.25 μm, H2; Program: 60 0C (3 min) 2 K/min -> 220 0C 5 K/min -> 250 0C (15 min)
CapillaryFFAP1226.Buettner and Schieberle, 199930. m/0.32 mm/0.25 μm, He; Program: 35C (2min) => 40C/min => 60C (2min) => 6C/min => 180C => 10C/min => 230C (10min)
CapillaryHP-Innowax1244.Iversen, Jakobsen, et al., 199860. m/0.25 mm/0.25 μm, He; Program: 32C(1.5min) => 3C/min => 40C (10min) => 3C/min => 200C (10min)
CapillarySupelcowax-101235.Cadwallader and Xu, 199460. m/0.25 mm/0.25 μm, He; Program: 40C => (6C/min) => 80C(6min) => (15C/min) => 200C(10min)
CapillaryCarbowax 20M1241.Whitfield, Shea, et al., 1981Column length: 150. m; Column diameter: 0.75 mm; Program: not specified

Normal alkane RI, non-polar column, isothermal

View large format table.

Column type Active phase Temperature (C) I Reference Comment
PackedSE-3070.990.Yabumoto, Jennings, et al., 1977

Normal alkane RI, non-polar column, temperature ramp

View large format table.

Column type Active phase I Reference Comment
CapillaryOptima-5996.Al-Qudah, Muhaidat, et al., 201230. m/0.25 mm/0.25 μm, Helium, 60. C @ 1. min, 3. K/min; Tend: 246. C
CapillaryDB-5997.Fraternale, Ricci, et al., 201130. m/0.25 mm/0.25 μm, Helium, 3. K/min; Tstart: 60. C; Tend: 240. C
CapillaryDB-5 MS1011.Majcher, Lawrowski, et al., 201025. m/0.20 mm/0.33 μm, Helium, 40. C @ 1. min, 10. K/min; Tend: 250. C
CapillaryHP-5 MS998.Pino, Marquez, et al., 201030. m/0.32 mm/0.25 μm, Helium, 50. C @ 2. min, 4. K/min, 240. C @ 10. min
CapillarySE-541001.Laselan, Buettner, et al., 200930. m/0.32 mm/0.25 μm, 0. C @ 2. min, 6. K/min; Tend: 200. C
CapillaryDB-51000.Mallia, Escher, et al., 200960. m/0.32 mm/0.25 μm, Helium, 6. K/min, 240. C @ 5. min
CapillaryDB-5998.Scrivanti, Anton, et al., 200930. m/0.25 mm/0.25 μm, Nitrogen, 2. K/min; Tstart: 40. C; Tend: 230. C
CapillaryRTX-5998.Berdague, Tournayre, et al., 200760. m/0.32 mm/1. μm, 40. C @ 5. min, 4. K/min, 205. C @ 5. min
CapillaryRTX-5998.Setkova, Risticevic, et al., 200710. m/0.18 mm/0.2 μm, He, 40. C @ 0.5 min, 50. K/min, 275. C @ 0.5 min
CapillaryElite-5MS999.Tava, Pecetti, et al., 200730. m/0.32 mm/0.5 μm, He, 40. C @ 5. min, 4. K/min, 280. C @ 10. min
CapillaryUltra-21004.Ceva-Antunes, Bizzo, et al., 200625. m/0.25 mm/0.33 μm, H2, 40. C @ 2. min, 3. K/min, 280. C @ 10. min
CapillaryDB-1981.Chen, Sheu, et al., 2006Nitrogen, 40. C @ 1. min, 2. K/min, 200. C @ 9. min; Column length: 60. m; Column diameter: 0.25 mm
CapillaryDB-51010.Fan and Qian, 200630. m/0.32 mm/1. μm, He, 40. C @ 2. min, 4. K/min, 250. C @ 15. min
CapillaryDB-51005.Fan and Qian, 2006, 230. m/0.32 mm/1. μm, N2, 40. C @ 2. min, 6. K/min, 230. C @ 15. min
CapillaryDB-51001.El-Sayed, Heppelthwaite, et al., 200530. m/0.25 mm/0.25 μm, 40. C @ 2. min, 4. K/min; Tend: 240. C
CapillaryDB-51010.Fan and Qian, 200530. m/0.32 mm/0.25 μm, N2, 40. C @ 2. min, 4. K/min, 250. C @ 5. min
CapillaryHP-5MS996.Tesevic, Nikicevic, et al., 200530. m/0.25 mm/0.25 μm, He, 4.3 K/min; Tstart: 60. C; Tend: 285. C
CapillaryRTX-51003.Tokitomo, Steihaus, et al., 200560. m/0.53 mm/1.5 μm, Helium, 6. K/min; Tstart: 0. C; Tend: 240. C
CapillaryCP Sil 8 CB1002.Wang, Guo, et al., 200430. m/0.32 mm/0.25 μm, 50. C @ 5. min, 5. K/min; Tend: 200. C
CapillarySPB-51001.Ledauphin, Guichard, et al., 200330. m/0.32 mm/0.25 μm, He, 40. C @ 1. min, 5. K/min, 220. C @ 20. min
CapillaryOV-101988.Murakami, Goldstein, et al., 200312. m/0.32 mm/0.32 μm, 35. C @ 3. min, 6. K/min; Tend: 225. C
CapillarySPB-1985.Vichi, Castellote, et al., 200330. m/0.25 mm/0.25 μm, He, 40. C @ 10. min, 3. K/min; Tend: 200. C
CapillarySPB-1987.Vichi, Pizzale, et al., 200330. m/0.25 mm/0.25 μm, He, 40. C @ 10. min, 3. K/min; Tend: 200. C
CapillaryDB-5994.Caredda, Marongiu, et al., 200230. m/0.25 mm/0.25 μm, He, 3. K/min, 280. C @ 30. min; Tstart: 60. C
CapillaryHP-5998.Gallori, Flamini, et al., 200130. m/0.25 mm/0.25 μm, N2, 60. C @ 10. min, 5. K/min; Tend: 220. C
CapillaryDB-5MS1000.Suriyaphan, Drake, et al., 200130. m/0.32 mm/0.25 μm, He, 40. C @ 5. min, 5. K/min, 195. C @ 40. min
CapillaryHP-51002.Bicalho, Pereira, et al., 200030. m/0.25 mm/0.25 μm, H2, 40. C @ 10. min, 3. K/min, 280. C @ 10. min
CapillaryHP-5997.García, Martín, et al., 200060. m/0.32 mm/1. μm, He, 3. K/min; Tstart: 40. C; Tend: 240. C
CapillaryDB-51000.Kotseridis and Baumes, 200030. m/0.32 mm/0.5 μm, H2, 60. C @ 3. min, 3. K/min, 245. C @ 20. min
CapillaryDB-1990.Rapior, Konska, et al., 200025. m/0.25 mm/0.13 μm, He, 60. C @ 2. min, 4. K/min; Tend: 200. C
CapillaryMethyl Silicone983.Vendramini and Trugo, 200050. m/0.25 mm/0.5 μm, H2, 40. C @ 0.5 min, 4. K/min; Tend: 260. C
CapillaryBP-51004.Lopez, Ferreira, et al., 199950. m/0.32 mm/1. μm, He, 40. C @ 5. min, 2. K/min; Tend: 190. C
CapillaryDB-5996.Meynier, Novelli, et al., 199930. m/0.32 mm/1. μm, 40. C @ 5. min, 3. K/min; Tend: 200. C
CapillaryBP-51004.Ferreira, Ardanuy, et al., 199850. m/0.32 mm/1. μm, He, 40. C @ 5. min, 2. K/min; Tend: 190. C
CapillaryHP-1982.Ong, Acree, et al., 19984. K/min; Column length: 25. m; Column diameter: 0.32 mm; Tstart: 35. C; Tend: 250. C
CapillarySE-54993.Weenen, Koolhaas, et al., 199650. m/0.32 mm/1.05 μm, He, 2. K/min; Tstart: 40. C; Tend: 300. C
CapillaryHP-5998.Larsen and Frisvad, 199535. C @ 2. min, 6. K/min; Tend: 200. C
CapillaryDB-51002.Moio, Dekimpe, et al., 199330. m/0.32 mm/1. μm, H2, 3. K/min; Tstart: 40. C; Tend: 220. C
CapillaryDB-51003.Moio, Dekimpe, et al., 199330. m/0.32 mm/1. μm, H2, 3. K/min; Tstart: 40. C; Tend: 220. C
CapillaryDB-51003.Moio, Langlois, et al., 199330. m/0.32 mm/1. μm, H2, 40. C @ 5. min, 5. K/min; Tend: 220. C
CapillaryDB-5996.Shimoda, Shibamoto, et al., 199360. m/0.25 mm/0.25 μm, He, 40. C @ 2. min, 3. K/min; Tend: 200. C
CapillaryDB-1981.Hansen, Buttery, et al., 199230. C @ 25. min, 4. K/min, 200. C @ 20. min; Column length: 60. m; Column diameter: 0.32 mm
CapillaryDB-1980.Peppard, 199230. m/0.25 mm/1.0 μm, He, 3. K/min, 250. C @ 30. min; Tstart: 40. C
CapillaryDB-1984.Peppard, 199230. m/0.25 mm/1.0 μm, He, 3. K/min, 250. C @ 30. min; Tstart: 40. C
CapillaryDB-1979.Shiota, 199160. m/0.25 mm/0.25 μm, He, 3. K/min; Tstart: 50. C; Tend: 240. C
CapillaryDB-1996.Shiota, 199160. m/0.25 mm/0.25 μm, He, 3. K/min; Tstart: 50. C; Tend: 240. C
CapillaryOV-101983.Anker, Jurs, et al., 19902. K/min; Column length: 50. m; Column diameter: 0.28 mm; Tstart: 80. C; Tend: 200. C
CapillaryDB-1986.Takeoka and Butter, 1989He, 30. C @ 4. min, 2. K/min; Column length: 60. m; Column diameter: 0.32 mm; Tend: 210. C
CapillaryDB-1988.Takeoka and Butter, 1989He, 30. C @ 4. min, 2. K/min; Column length: 60. m; Column diameter: 0.32 mm; Tend: 210. C
CapillarySE-30981.Dirinck, de Pooter, et al., 1981N2, 2. K/min; Column length: 200. m; Column diameter: 0.6 mm; Tstart: 20. C; Tend: 220. C
CapillarySE-30991.Alves and Jennings, 1979Helium, 2. K/min; Tstart: 70. C; Tend: 170. C
CapillaryOV-1982.Schreyen, Dirinck, et al., 1979N2, 1. K/min; Column length: 183. m; Column diameter: 0.762 mm; Tstart: 0. C; Tend: 230. C

Normal alkane RI, non-polar column, custom temperature program

View large format table.

Column type Active phase I Reference Comment
CapillaryCP-Sil 5 CB975.Collin, Nizet, et al., 201250. m/0.32 mm/1.20 μm, Nitrogen; Program: 36 0C 20 0C/min -> 85 0C 1 0C/min -> 145 0C 3 0C/min -> 250 0C
CapillarySiloxane, 5 % Ph985.VOC BinBase, 2012Program: not specified
CapillaryCP-Sil 8 CB1000.de Freitas, Garruti, et al., 201130. m/0.25 mm/0.25 μm, Hydrogen; Program: 30 0C 3 0C/min -> 150 0C 20 0C/min -> 220 0C
CapillaryDB-51001.Miyazaki, Plotto, et al., 201160. m/0.25 mm/1.00 μm, Helium; Program: 40 0C 4 0C/min -> 230 0C 100 0C/min -> 260 0C (11.7 min)
CapillaryPolydimethyl siloxane, 5 % phenyl985.Skogerson, Wohlgemuth, et al., 2011Program: not specified
CapillaryCP Sil-5 CB975.Bailly and Collin, 201050. m/0.32 mm/1.20 μm, Nitrogen; Program: 36 0C 20 0C/min -> 85 0C 1 0C/min -> 145 0C 3 0C/min -> 250 0C
CapillaryHP-5 MS998.Pino, Marquez, et al., 201030. m/0.32 mm/0.25 μm, Helium; Program: not specified
CapillaryDB-5999.San-Juan, Petka, et al., 201030. m/0.32 mm/0.50 μm, Hydrogen; Program: 40 0C (5 min) 4 0C/min -> 100 0C 6 0C/min -> 220 0C (20 min)
CapillaryCP-Sil 5 CB975.Bailly, Jerkovic, et al., 200950. m/0.32 mm/1.20 μm, Nitrogen; Program: 36 0C 20 0C/min -> 85 0C 1 0C -> 145 0C 3 0C/min -> 250 0C
CapillaryHP-5 MS1007.Fan, Lu, et al., 200930. m/0.25 mm/0.25 μm, Helium; Program: 40 0C (3 min) 3 0C/min -> 160 0C (2 min) 8 0C/min -> 220 0C (3 min)
CapillaryHP-5995.Pugliese, Sirtori, et al., 200950. m/0.32 mm/1.05 μm, Helium; Program: not specified
CapillaryHP-5999.Rotsatschakul, Visesanguan, et al., 200960. m/0.25 mm/0.25 μm, Helium; Program: 30 0C (2 min) 2 0Cmin -> 60 0C 10 0C/min -> 100 0C 20 0C/min -> 140 0C 10 0C/min -> 200 0C (10 min)
CapillaryBPX-51007.se Souza, Cardeal, et al., 200930. m/0.25 mm/0.25 μm, Helium; Program: 35 0C (5 min) 3 0C/min -> 210 0C 40 0C/min -> 240 0C (10 min)
CapillaryBPX-5999.se Souza, Cardeal, et al., 200930. m/0.25 mm/0.25 μm, Helium; Program: not specified
CapillaryHP-5998.Zhao, Li, et al., 200830. m/0.25 mm/0.25 μm; Program: 40 0C (2 min) 5 0C/min -> 80 0C 7 oC/min -> 160 0C 9 0C/min -> 200 0C 20 0C/min -> 280 0C (10 min)
CapillaryHP-51010.Zhao, Li, et al., 200830. m/0.25 mm/0.25 μm; Program: not specified
CapillaryDB-5999.Beaulieu and Lancaster, 200730. m/0.25 mm/0.25 μm; Program: 50C(1min) => 5C/min => 100C => 10C/min => 250C (9min)
CapillarySPB-1977.Bosch-Fuste, Riu-Aumatell, et al., 200730. m/0.25 mm/0.25 μm, He; Program: 40C(10min) => 2C/min => 200C(1min) => 2C/min => 250C (10min)
CapillaryDB-5 MS959.Cajka, Hajslova, et al., 200730. m/0.25 mm/0.25 μm, Helium; Program: 45 0C (0.75 min) 10 0C/min -> 200 0C 30 0C/min -> 245 0C (1.25 min)
CapillaryMethyl Silicone976.Chen and Feng, 2007Program: not specified
CapillaryLM-51000.Janzanntti, Franco, et al., 2007Helium; Column length: 30. m; Column diameter: 0.25 mm; Program: 50 0C (10 min) 2 oC/min -> 75 0C 3 0C/min -> 150 0C 5 0C/min -> 200 0C
CapillaryLM-51000.Janzanntti, Franco, et al., 2007Helium; Column length: 30. m; Column diameter: 0.25 mm; Program: not specified
CapillaryLM-5983.Janzanntti, Franco, et al., 2007Helium; Column length: 30. m; Column diameter: 0.25 mm; Program: not specified
CapillaryVB-5984.Karlshøj, Nielsen, et al., 200760. m/0.25 mm/1. μm, He; Program: 35C(1min) => 4C/min => 175C => 10C/min => 260C
CapillarySE-30976.Liu, Liang, et al., 2007Program: not specified
CapillaryCP-Sil999.Proffit, 200730. m/0.25 mm/0.25 μm, Helium; Program: 50 0C (3 min) 3 0C/min -> 100 0C 2.7 0C/min -> 140 0C 2.4 0C/min -> 180 0C 6 0C/min -> 250 0C
CapillaryDB-5996.Soares, Pereira, et al., 200730. m/0.25 mm/0.50 μm, Helium; Program: 35 0C (6 min) 5 0C/min -> 50 0C 2 0C/min -> 70 0C 3 0C/min -> 150 0C 5 0C/min -> 200 0C
CapillaryHP-5994.Splivallo, Bossi, et al., 2007He; Program: 50C => 3C/min => 200C(10min) => 10C/min => 290C(10min)
CapillaryCP-Sil 5 CB975.Bailly, Jerkovic, et al., 200650. m/0.32 mm/1.20 μm, Helium; Program: 36 0C 20 0C/min -> 85 0C 1 0C/min -> 1345 0C 3 0C/min -> 250 0C
CapillaryCP Sil 5 CB975.Bailly, Jerkovic, et al., 2006, 250. m/0.32 mm/1.2 μm, He; Program: 36C => 20C/min => 85C => 1C/min => 145C => 3C/min => 250C
CapillaryUltra-2996.Ceva-Antunes, Bizzo, et al., 200625. m/0.25 mm/0.33 μm, H2; Program: not specified
CapillarySPB-1984.Riu-Aumatell, Bosch-Fuste´, et al., 200630. m/0.25 mm/0.25 μm; Program: not specified
CapillaryDB-5999.Beaulieu, 200560. m/0.25 mm/0.25 μm; Program: 50C => 5C/min => 100C => 15C/min => 250C (19C)
CapillaryHP-5994.Riu-Aumatell, Lopez-Tamames, et al., 2005Program: not specified
CapillaryDB-51002.Tokitomo, Steihaus, et al., 200530. m/0.32 mm/0.25 μm, Helium; Program: 40 0C (2 min) 40 0C/min -> 60 0C (2 min) 6 0C/min -> 180 0C 10 0C/min -> 240 0C (5 min)
CapillarySE-541002.Buettner, 200430. m/0.32 mm/0.25 μm, He; Program: 40C(2min) => 40C/min => 50C(2min) => 6C/min => 180C => 15C/min => 230C (10min)
CapillaryHP-1981.Carpino, Mallia, et al., 200412. m/0.32 mm/0.52 μm; Program: 35C(3min) => 6C/min => 190C => 30C/min => 225C
CapillaryHP-1981.Carpino, Mallia, et al., 2004, 225. m/0.2 mm/0.11 μm; Program: 35C(3min) => 4C/min => 190C => 30C/min => 225C(3min)
CapillarySPB-5996.Crook, Boylston, et al., 200430. m/0.25 mm/0.25 μm, He; Program: 30C(3min) => 5C/min => 80C => 4C/min => 95C => 5C/min => 115C => 10C/min => 200C
CapillaryMFE-73999.Escudero, Gogorza, et al., 2004Program: not specified
CapillarySE-30983.Vinogradov, 2004Program: not specified
CapillaryDB-11000.Alves and Franco, 200330. m/0.25 mm/0.25 μm, H2; Program: 40C(10min) => 2C/min => 110C => 5C/min => 200C(10min)
CapillaryHP-51001.Demyttenaere, Dagher, et al., 200330. m/0.25 mm/0.25 μm, He; Program: 40C(1min) => 5C/min => 180C => 10C/min => 220C(2min)
CapillaryHP-51001.Demyttenaere, Sánchez Martínez, et al., 200330. m/0.25 mm/0.25 μm, He; Program: 35C => 5C/min => 220C => 10C/min => 240C(5min)
CapillaryHP-5997.Jordán, Margaría, et al., 200330. m/0.25 mm/0.25 μm; Program: 40C(6min) => 2.5C/min => 150C => 90C/min => 250C
CapillaryHP-5997.Jordán, Margaría, et al., 200330. m/0.25 mm/0.25 μm; Program: 40C(6min) => 2.5C/min => 150C => 90C/min => 250C
CapillaryOV-101983.Krings, Banavara, et al., 2003Program: not specified
CapillaryHP-5MS1001.Martí, Mestres, et al., 200330. m/0.25 mm/0.25 μm, He; Program: 40C(5min) => 2C/min => 120C => 10C/min => 210C (30min)
CapillaryDB-5997.Qian and Reineccius, 200330. m/0.32 mm/1. μm; Program: 35C(4min) => 2C/min => 130C => 4C/min => 250C
CapillaryHP-5MS1001.Demyttenaere, Dagher, et al., 200230. m/0.25 mm/0.25 μm, He; Program: 40C(1min) => 5C/min => 220C => 10C/min => 240C(2min)
CapillaryHP-5MS1001.Demyttenaere, Sánchez Martínez, et al., 200230. m/0.25 mm/0.25 μm, He; Program: 35C => 5C/min => 160C => 10C/min => 220C (10min)
CapillaryMFE-73999.Ferreira, Ortín, et al., 2002H2; Program: not specified
CapillaryHP-5997.Jordán, Goodner, et al., 200230. m/0.25 mm/0.25 μm; Program: not specified
CapillaryHP-5995.Jordán, Goodner, et al., 200230. m/0.25 mm/0.25 μm; Program: not specified
CapillaryHP-5997.Jordán, Margaría, et al., 200230. m/0.25 mm/0.25 μm; Program: 40C (6min) => 2.5C/min => 150C => 90C/min => 250C
CapillaryHP-5MS1003.Ansorena, Gimeno, et al., 200130. m/0.25 mm/0.25 μm, He; Program: 40C (10min) => 3C/min => 120C => 10C/min => 250C (5min)
CapillaryMFE-73999.Aznar, López, et al., 200130. m/0.32 mm/0.1 μm, H2; Program: 40C(5min) => 2C/min => 120C => 10C/min => 210C(30min)
CapillaryMFE-73999.Ferreira, Aznar, et al., 200130. m/0.32 mm/0.1 μm, H2; Program: 40 C (5min) => 2C/min => 120C => 10 C/min => 210 C (30min)
CapillaryCP Sil 5 CB974.Lermusieau, Bulens, et al., 200150. m/0.32 mm/1.2 μm; Program: 36C => 20C/min => 120C(20min) => 2C/min => 250C(30min)
CapillaryHP-1980.Teai, Claude-Lafontaine, et al., 200150. m/0.32 mm/0.52 μm, N2; Program: 40C => 2C/min => 130C => 4C/min => 250C
CapillaryHP-51003.Ansorena, Astiasarán, et al., 200030. m/0.25 mm/0.25 μm, He; Program: 40C (10min) => 3C/min => 120C => 10C/min => 250C (5min)
CapillaryMethyl Silicone983.Estrada and Gutierrez, 1999Program: not specified
CapillaryMethyl Silicone980.Zenkevich, 1999Program: not specified
CapillaryHP-1984.Ong, Acree, et al., 1998Column length: 25. m; Column diameter: 0.32 mm; Program: not specified
CapillaryDB-51000.Guth, 199730. m/0.32 mm/0.25 μm; Program: 35C (1min) => 40C/min => 60C (1min) => 6C/min => 250C (10min)
CapillarySE-541000.Guth, 199730. m/0.32 mm/0.25 μm; Program: 35C (1min) => 40C/min => 60C (1min) => 6C/min => 250C (10min)
CapillaryDB-51002.Mateo and Zumalacárregui, 199650. m/0.32 mm/0.25 μm, He; Program: 40C (10min) => 3C/min => 95C => 10C/min => 270C (10min)
CapillaryDB-51000.Mateo and Zumalacárregui, 199650. m/0.32 mm/0.25 μm, He; Program: 40C (10min) => 3C/min => 95C => 10C/min => 270C (10min)
CapillaryMethyl Silicone980.Grundschober, 1991Program: not specified
CapillaryDB-1981.Takeoka, Flath, et al., 198830. m/0.25 mm/0.25 μm, H2; Program: 30C (2min) => 2C/min => 150C => 4C/min => 250C
CapillaryDB-1981.Takeoka, Flath, et al., 198830. m/0.25 mm/0.25 μm, H2; Program: 30C (2min) => 2C/min => 150C => 4C/min => 250C
CapillaryOV-101983.Morales and Duque, 1987He; Column length: 25. m; Column diameter: 0.31 mm; Program: not specified
CapillaryOV-101983.Shibamoto, 1987Column length: 50. m; Column diameter: 0.25 mm; Program: not specified
CapillaryOV-1, SE-30, Methyl silicone, SP-2100, OV-101, DB-1, etc.981.Waggott and Davies, 1984Hydrogen; Column length: 50. m; Column diameter: 0.32 mm; Program: not specified

Normal alkane RI, polar column, isothermal

View large format table.

Column type Active phase Temperature (C) I Reference Comment
PackedCarbowax 20M100.1232.Yabumoto, Jennings, et al., 1977

Normal alkane RI, polar column, temperature ramp

View large format table.

Column type Active phase I Reference Comment
CapillaryInnowax1238.Siristova, Prinosilova, et al., 201230. m/0.25 mm/0.25 μm, Helium, 40. C @ 1. min, 8. K/min, 250. C @ 2.75 min
CapillaryVF-Wax MS1234.Duarte, Dias, et al., 201060. m/0.25 mm/0.25 μm, Helium, 60. C @ 5. min, 3. K/min, 220. C @ 25. min
CapillaryDB-FFAP1226.Laselan, Buettner, et al., 200930. m/0.32 mm/0.25 μm, 0. C @ 2. min, 6. K/min; Tend: 200. C
CapillaryDB-Wax1223.Mallia, Escher, et al., 200930. m/0.32 mm/0.25 μm, Helium, 6. K/min, 240. C @ 5. min
CapillaryCP-Wax1205.Mo, Fan, et al., 200960. m/0.25 mm/0.25 μm, Helium, 50. C @ 2. min, 6. K/min, 230. C @ 15. min
CapillaryDB-Wax1232.Zhao, Xu, et al., 200930. m/0.25 mm/0.25 μm, Helium, 40. C @ 2. min, 3. K/min, 230. C @ 5. min
CapillaryDB-Wax1231.Beck, Higbee, et al., 200860. m/0.32 mm/0.25 μm, Helium, 30. C @ 4. min, 2. K/min, 200. C @ 30. min
CapillaryDB-Wax1232.Beck, Higbee, et al., 200860. m/0.32 mm/0.25 μm, Helium, 30. C @ 4. min, 2. K/min, 200. C @ 30. min
CapillaryCP-Wax 57 CB1208.Callejon, Morales, et al., 200850. m/0.25 mm/0.20 μm, Hydrogen, 35. C @ 5. min, 4. K/min, 150. C @ 17.5 min
CapillaryDB-Wax1251.Caldeira, de Sousa, et al., 200830. m/0.25 mm/0.25 μm, Helium, 40. C @ 10. min, 3.5 K/min, 180. C @ 30. min
CapillaryInnowax1236.Kaypak and Avsar, 200830. m/0.25 mm/0.25 μm, 40. C @ 5. min, 10. K/min, 200. C @ 15. min
CapillarySupelcowax-101221.Chin, Nazimah, et al., 200710. m/0.1 mm/0.1 μm, He, 40. C @ 1.5 min, 50. K/min, 240. C @ 2. min
CapillaryDB-Wax1243.Dury-Brun, Fournier, et al., 200730. m/0.32 mm/0.5 μm, He, 5. K/min; Tstart: 40. C; Tend: 240. C
CapillaryCarbowax 20M1244.Kafkas and Paydas, 200725. m/0.25 mm/0.40 μm, Helium, 5. K/min, 260. C @ 40. min; Tstart: 60. C
CapillaryDB-Wax1235.Xu, Fan, et al., 200730. m/0.25 mm/0.25 μm, He, 40. C @ 2. min, 4. K/min, 230. C @ 5. min
CapillaryDB-Wax1223.Berlinet, Brat, et al., 200630. m/0.25 mm/0.25 μm, Helium, 3. K/min, 250. C @ 20. min; Tstart: 40. C
CapillaryDB-Wax1235.Fan and Qian, 200630. m/0.32 mm/0.25 μm, He, 40. C @ 2. min, 4. K/min, 230. C @ 15. min
CapillaryDB-Wax1231.Fan and Qian, 2006, 230. m/0.32 mm/0.25 μm, N2, 40. C @ 2. min, 6. K/min, 230. C @ 15. min
CapillaryDB-Wax1235.Kishimoto, Wanikawa, et al., 200615. m/0.32 mm/0.25 μm, He, 6. K/min, 230. C @ 20. min; Tstart: 40. C
CapillaryHP-Innowax1217.Komes, Ulrich, et al., 200630. m/0.25 mm/0.5 μm, He, 40. C @ 3. min, 2. K/min, 200. C @ 15. min
CapillaryDB-Wax Etr1254.Perestrelo, Fernandes, et al., 200630. m/0.25 mm/0.25 μm, He, 40. C @ 1. min, 2. K/min, 220. C @ 10. min
CapillaryDB-Wax1234.Fan and Qian, 200530. m/0.32 mm/0.25 μm, N2, 40. C @ 2. min, 4. K/min, 230. C @ 5. min
CapillaryStabilwax DA1222.Nogueira, Lubachevsky, et al., 200560. m/0.25 mm/0.5 μm, 40. C @ 5. min, 5. K/min; Tend: 180. C
CapillaryDB-Wax1251.Qian and Wang, 200560. m/0.32 mm/0.50 μm, Nitrogen, 35. C @ 4. min, 2. K/min, 235. C @ 30. min
CapillaryDB-Wax1270.Culleré, Escudero, et al., 200430. m/0.32 mm/0.5 μm, H2, 40. C @ 5. min, 4. K/min; Tend: 200. C
CapillaryDB-Wax1233.Jiang and Kubota, 2004He, 60. C @ 4. min, 2. K/min; Column length: 60. m; Column diameter: 0.25 mm; Tend: 220. C
CapillaryDB-Wax1248.López, Ezpeleta, et al., 200460. m/0.25 mm/0.25 μm, He, 40. C @ 5. min, 3. K/min; Tend: 220. C
CapillaryPEG-20M1233.Narain, Almeida, et al., 200450. m/0.20 mm/0.20 μm, 40. C @ 5. min, 3. K/min, 180. C @ 30. min
CapillaryDB-Wax1229.Alves and Franco, 200330. m/0.25 mm/0.5 μm, H2, 50. C @ 10. min, 3. K/min, 200. C @ 10. min
CapillaryDB-Wax1229.Lee and Noble, 200330. m/0.25 mm/0.25 μm, He, 40. C @ 4. min, 4. K/min, 185. C @ 20. min
CapillaryDB-Wax1258.López, Ortín, et al., 200330. m/0.32 mm/0.5 μm, H2, 40. C @ 5. min, 4. K/min; Tend: 200. C
CapillaryDB-FFAP1225.Czerny and Schieberle, 200230. m/0.32 mm/0.25 μm, He, 40. C @ 2. min, 6. K/min, 230. C @ 10. min
CapillaryDB-Wax1259.Ferreira, Ortín, et al., 200230. m/0.32 mm/0.5 μm, H2, 40. C @ 5. min, 4. K/min; Tend: 200. C
CapillaryDB-Wax1233.Hayata, Sakamoto, et al., 200260. m/0.25 mm/0.25 μm, He, 40. C @ 10. min, 3. K/min, 220. C @ 10. min
CapillaryHP-FFAP1224.Qian and Reineccius, 200225. m/0.32 mm/0.52 μm, 60. C @ 1. min, 5. K/min, 240. C @ 5. min
CapillaryHP-FFAP1224.Qian and Reineccius, 200225. m/0.32 mm/0.52 μm, 60. C @ 1. min, 5. K/min, 240. C @ 5. min
CapillaryDB-Wax1244.Aznar, López, et al., 200130. m/0.32 mm/0.5 μm, H2, 40. C @ 5. min, 4. K/min, 200. C @ 60. min
CapillaryFFAP1232.Ducruet, Fournier, et al., 200130. m/0.32 mm/0.25 μm, H2, 40. C @ 5. min, 3. K/min; Tend: 240. C
CapillaryDB-Wax1244.Ferreira, Aznar, et al., 200130. m/0.32 mm/0.5 μm, H2, 40. C @ 5. min, 4. K/min, 200. C @ 60. min
CapillaryDB-FFAP1221.Suriyaphan, Drake, et al., 200130. m/0.32 mm/0.25 μm, He, 40. C @ 5. min, 5. K/min, 195. C @ 40. min
CapillaryDB-Wax1220.Wei, Mura, et al., 200160. m/0.25 mm/0.25 μm, He, 2. K/min; Tstart: 40. C; Tend: 200. C
CapillaryDB-Wax1252.Franco and Shibamoto, 2000He, 50. C @ 8. min, 3. K/min; Column length: 30. m; Column diameter: 0.2 mm; Tend: 180. C
CapillaryDB-Wax1259.Franco and Shibamoto, 2000He, 50. C @ 8. min, 3. K/min; Column length: 30. m; Column diameter: 0.2 mm; Tend: 180. C
CapillarySupelcowax-101222.Korány, Mednyánszky, et al., 200060. m/0.25 mm/0.25 μm, He, 4. K/min; Tstart: 60. C; Tend: 280. C
CapillaryDB-Wax1227.Kotseridis and Baumes, 200030. m/0.32 mm/0.5 μm, H2, 60. C @ 3. min, 3. K/min, 245. C @ 20. min
CapillaryDB-Wax1236.Paniandy, Chane-Ming, et al., 200060. m/0.32 mm/0.25 μm, Helium, 50. C @ 2. min, 5. K/min; Tend: 230. C
CapillaryCP-Wax 52CB1223.Hwan and Chou, 199950. m/0.32 mm/0.22 μm, H2, 60. C @ 4. min, 2. K/min, 190. C @ 21. min
CapillaryDB-Wax1253.Iwatsuki, Mizota, et al., 19994. K/min; Column length: 30. m; Column diameter: 0.53 mm; Tstart: 60. C; Tend: 210. C
CapillaryCarbowax 20M1238.Lopez, Ferreira, et al., 199960. m/0.32 mm/0.5 μm, He, 40. C @ 5. min, 2. K/min; Tend: 190. C
CapillarySupelcowax-101239.Campeanu, Burcea, et al., 199860. m/0.32 mm/0.5 μm, H2, 35. C @ 5. min, 5. K/min, 250. C @ 20. min
CapillaryCarbowax 20M1238.Ferreira, Ardanuy, et al., 199860. m/0.32 mm/0.5 μm, He, 40. C @ 5. min, 2. K/min; Tend: 190. C
CapillaryCarbowax 20M1238.Ferreira, Ardanuy, et al., 199860. m/0.32 mm/0.5 μm, He, 40. C @ 5. min, 2. K/min; Tend: 190. C
CapillaryCarbowax 20M1238.Ferreira, Lopez, et al., 199860. m/0.32 mm/0.5 μm, He, 40. C @ 5. min, 2. K/min; Tend: 190. C
CapillaryHP-Innowax1183.Ulrich, Hoberg, et al., 199760. m/0.32 mm/0.5 μm, H2, 1.5 K/min; Tstart: 50. C; Tend: 180. C
CapillaryDB-Wax1248.Wada and Shibamoto, 1997He, 3. K/min, 200. C @ 40. min; Column length: 60. m; Column diameter: 0.25 mm; Tstart: 50. C
CapillaryDB-Wax1209.Morales, Albarracín, et al., 199630. m/0.25 mm/0.25 μm, He, 20. C @ 4. min, 4. K/min, 200. C @ 10. min
CapillaryDB-Wax1199.Morales, Albarracín, et al., 199630. m/0.25 mm/0.25 μm, He, 50. C @ 4. min, 4. K/min, 200. C @ 10. min
CapillaryTC-Wax1231.Shuichi, Masazumi, et al., 199680. C @ 5. min, 3. K/min; Column length: 60. m; Column diameter: 0.25 mm; Tend: 240. C
CapillaryDB-Wax1218.Christensen and Reineccius, 199530. m/0.25 mm/0.25 μm, 20. C @ 1. min, 5. K/min; Tend: 230. C
CapillaryCP-Wax 52CB1231.3Chyau, Chen, et al., 199250. m/0.32 mm/0.22 μm, H2, 50. C @ 5. min, 2. K/min; Tend: 200. C
CapillaryCarbowax 20M1223.Anker, Jurs, et al., 19902. K/min; Column length: 80. m; Column diameter: 0.2 mm; Tstart: 70. C; Tend: 170. C
CapillarySP-10001236.De Llano D.G., Ramos M., et al., 199025. m/0.2 mm/0.43 μm, N2, 4. K/min, 190. C @ 30. min; Tstart: 60. C
CapillaryDB-Wax1228.Binder and Flath, 198950. C @ 0.1 min, 4. K/min, 250. C @ 5. min; Column length: 60. m; Column diameter: 0.32 mm
CapillaryDB-Wax1228.Takeoka and Butter, 198960. m/0.32 mm/0.25 μm, He, 30. C @ 4. min, 2. K/min; Tend: 180. C
CapillaryDB-Wax1228.Takeoka and Butter, 198960. m/0.32 mm/0.25 μm, He, 30. C @ 4. min, 2. K/min; Tend: 180. C
CapillaryCarbowax 20M1223.Mihara, Tateba, et al., 1988N2, 3. K/min; Column length: 50. m; Column diameter: 0.22 mm; Tstart: 80. C; Tend: 200. C
CapillaryCarbowax 20M1227.Mihara, Tateba, et al., 1988N2, 3. K/min; Column length: 50. m; Column diameter: 0.22 mm; Tstart: 80. C; Tend: 200. C
CapillaryCarbowax 20M1223.Mihara, Tateba, et al., 1988N2, 3. K/min; Column length: 50. m; Column diameter: 0.22 mm; Tstart: 80. C; Tend: 200. C
CapillaryCarbowax 20M1227.Mihara, Tateba, et al., 1988N2, 3. K/min; Column length: 50. m; Column diameter: 0.22 mm; Tstart: 80. C; Tend: 200. C
CapillaryCarbowax 20M1223.Mihara, Tateba, et al., 1987N2, 3. K/min; Column length: 50. m; Column diameter: 0.22 mm; Tstart: 80. C; Tend: 200. C
CapillaryCarbowax 20M1227.Mihara, Tateba, et al., 1987N2, 3. K/min; Column length: 50. m; Column diameter: 0.22 mm; Tstart: 80. C; Tend: 200. C
CapillaryCarbowax 20M1223.Mihara, Tateba, et al., 1987N2, 3. K/min; Column length: 50. m; Column diameter: 0.22 mm; Tstart: 80. C; Tend: 200. C
CapillaryCarbowax 20M1227.Mihara, Tateba, et al., 1987N2, 3. K/min; Column length: 50. m; Column diameter: 0.22 mm; Tstart: 80. C; Tend: 200. C
CapillaryCarbowax 20M1227.Engel and Tressl, 19832. K/min; Column length: 50. m; Column diameter: 0.32 mm; Tstart: 70. C; Tend: 180. C
PackedCarbowax1245.Schieberle and Grosch, 1983He, Chromosorb G AW DMCS, 4. K/min; Column length: 3. m; Tstart: 60. C; Tend: 180. C

Normal alkane RI, polar column, custom temperature program

View large format table.

Column type Active phase I Reference Comment
CapillaryFFAP-CB1241.Collin, Nizet, et al., 201225. m/0.32 mm/0.30 μm, Nitrogen; Program: 36 0C 20 0C/min -> 85 0C 1 0C/min -> 145 0C 3 0C/min -> 220 0C
CapillaryCarbowax 20M1223.Lee, Chong, et al., 2012Program: not specified
CapillaryInnowax1244.Siristova, Prinosilova, et al., 201230. m/0.25 mm/0.25 μm, Helium; Program: not specified
CapillaryDB-Wax1236.Welke, Manfroi, et al., 201230. m/0.25 mm/0.25 μm, Helium; Program: not specified
CapillaryDB-Wax1238.Welke, Manfroi, et al., 201230. m/0.25 mm/0.25 μm, Helium; Program: not specified
CapillaryDB-Wax1238.Welke, Manfroi, et al., 201230. m/0.25 mm/0.25 μm, Helium; Program: not specified
CapillaryDB-Wax1240.Miyazaki, Plotto, et al., 201160. m/0.25 mm/0.50 μm, Helium; Program: 40 0C 4 0C/min -> 230 0C 100 0C/min -> 260 0C (11.7 min)
CapillaryInnowax1233.Noorizadeh, Farmany, et al., 201160. m/0.25 mm/0.33 μm; Program: not specified
CapillaryCP-Wax 52 CB1252.Povolo, Cabassi, et al., 2011Program: not specified
CapillaryDB-Wax1237.Sampaio, Garruti, et al., 201130. m/0.25 mm/0.25 μm, Hydrogen; Program: 35 0C (9 min) 5 0C/min -> 80 0C 1 0C/min -> 100 0C 16 0C/min -> 210 0C (20 min)
CapillaryHP-Innowax1241.Xiao, Dai, et al., 201160. m/0.25 mm/0.25 μm, Helium; Program: 40 0C (2 min) 3 0C/min -> 150 0C 5 0C/min -> 220 0C (5 min)
CapillaryFFAP1241.Bailly and Collin, 201025. m/0.32 mm/0.30 μm, Nitrogen; Program: 36 0C 20 0C/min -> 85 0C 1 0C/min -> 145 0C 3 0C/min -> 250 0C
CapillaryDB-Wax1242.San-Juan, Petka, et al., 201030. m/0.32 mm/0.50 μm, Hydrogen; Program: 40 0C (5 min) 4 0C/min -> 100 0C 6 0C/min -> 220 0C (20 min)
CapillarySupelko CO Wax1258.Vekiari, Orepoulou, et al., 201060. m/0.32 mm/0.25 μm, Helium; Program: 40 0C (5 min) 4 0C/min -> 75 0C 5 0C/min -> 250 0C (10 min)
CapillarySupelko CO Wax1258.Vekiari, Orepoulou, et al., 201060. m/0.32 mm/0.25 μm, Helium; Program: not specified
CapillaryFFAP1241.Bailly, Jerkovic, et al., 200925. m/0.32 mm/0.30 μm, Nitrogen; Program: 36 0C 20 0C/min -> 85 0C 1 0C -> 145 0C 3 0C/min -> 230 0C
CapillaryStabilwax1240.Chinnici, Guerrero, et al., 200930. m/0.25 mm/0.25 μm, Helium; Program: 35 0C 3 0C/min -> 100 0C 5 0C/min -> 240 0C (10 min)
CapillaryDB-Wax1242.Ferreira, Juan, et al., 200930. m/0.32 mm/0.50 μm; Program: 40 0C (5 min) 4 0C/min -> 100 0C 6 0C/min -> 220 0C (40 min)
CapillaryDB-Wax1221.Rowan, Hunt, et al., 200920. m/0.18 mm/0.18 μm, Helium; Program: 35 0C (1 min) 2.9 0C/min -> 100 0C 8 0C/min -> 200 0C (5 min)
CapillaryDB-Wax1221.Rowan, Hunt, et al., 2009, 220. m/0.18 mm/0.18 μm, Helium; Program: 35 0C (1 min) 2/9 0C/min -> 100 0C 8 0C/min -> 200 0C (5 min)
CapillaryDB-Wax1238.Valappil, Fan, et al., 200930. m/0.32 mm/0.50 μm, Helium; Program: 40 0C 7 0C/min -> 110 0C 15 0C/min -> 250 0C (3 min)
CapillaryDB-Wax1223.Zhao, Xu, et al., 200930. m/0.25 mm/0.25 μm, Helium; Program: not specified
CapillaryDB-Wax1244.Li, Tao, et al., 200830. m/0.32 mm/0.25 μm, Helium; Program: 40 0C (3 min) 4 0C/min -> 160 0C 7 0C/min -> 220 0C (8 min)
CapillaryDB-Wax1205.Tao, Wenlai, et al., 200830. m/0.32 mm/0.25 μm, Helium; Program: 50 0C 20 0C/min -> 80 0C 3 0C/min -> 230 0C
CapillaryDB-Wax1244.Yongsheng, Hua, et al., 200830. m/0.32 mm/0.25 μm, Helium; Program: 40 0C (4 min) 3 0C/min -> 50 0C 5 0C/min -> 120 0C 7 0C/min -> 175 0C 10 0C/min -> 230 0C (8 min)
CapillaryPEG 20M1229.Zhang, Zhang, et al., 200830. m/0.25 mm/0.25 μm, Helium; Program: 40 0C (3 min) 5 0C/min -> 60 0C 6 0C/min -> 130 0C 10 0C/min -> 230 0C
CapillarySupelcowax-101238.Berard, Bianchi, et al., 200730. m/0.25 mm/0.25 μm, He; Program: 35C(8min) => 6C/min => 60C => 4C/min => 160C => 20C/min => 200C(1min)
CapillarySupelcowax-101242.Berard, Bianchi, et al., 200730. m/0.25 mm/0.25 μm, He; Program: 35C(8min) => 6C/min => 60C => 4C/min => 160C => 20C/min => 200C(1min)
CapillarySupelcowax-101232.Bosch-Fuste, Riu-Aumatell, et al., 200730. m/0.25 mm/0.25 μm, He; Program: 40C(10min) => 2C/min => 200C(1min) => 2C/min => 250C (10min)
CapillaryHP-20M1232.Chaieb, Hajlaoui, et al., 2007Program: not specified
CapillaryCarbowax 20M1224.Dury-Brun, Fournier, et al., 2007Program: not specified
CapillaryDB-FFAP1226.Lasekan, Buettner, et al., 200730. m/0.32 mm/0.25 μm; Program: 35C(2min) => 40C/min => 50C(2min) => 6C/min => 180C => 10C/min => 230C(10min)
CapillaryDB-Wax1244.Li, Tao, et al., 200730. m/0.32 mm/0.25 μm, He; Program: 40C(3min) => 4C/min => 160C => 7C/min => 230C (8min)
CapillaryFFAP1243.Lopez, Villatoro, et al., 200750. m/0.2 mm/0.33 μm, He; Program: 70C(1min) => 3C/min => 142C => 5C/min => 225C(10min)
CapillaryDB-Wax1246.Selli, 200730. m/0.32 mm/0.50 μm, Hydrogen; Program: 60 0C (3 min) 2 0C/min -> 220 0C 3 0C/min -> 245 0C (20 min)
CapillaryDB-Wax1224.Tian, Zhang, et al., 200730. m/0.25 mm/0.25 μm, He; Program: 50 0C (2 min) 6 0C/min -> 150 0C 8 0C/min -> 230 0C (15 min)
CapillaryHP-Innowax1233.Weldegergis B.T., Tredoux A.G.J., et al., 200730. m/0.25 mm/0.5 μm, He; Program: 30C(2min) => 4C/min => 130C => 8C/min => 250C(5min)
CapillaryPEG-20M1229.Zhang C., Zhang H., et al., 200730. m/0.25 mm/0.25 μm; Program: 40C(3min) => 5C/min => 60C => 6C/min => 130C => 10C/min => 230C (10min)
CapillaryFFAP-CB1241.Bailly, Jerkovic, et al., 200625. m/0.32 mm/0.30 μm, Helium; Program: 36 0C 20 0C/min -> 85 0C 1 0C/min -> 1345 0C 3 0C/min -> 250 0C
CapillaryFFAP1241.Bailly, Jerkovic, et al., 2006, 225. m/0.32 mm/0.3 μm, He; Program: 36C => 20C/min => 85C => 1C/min => 145C => 3C/min => 250C
CapillaryFFAP1243.Lara, Graell, et al., 200650. m/0.2 mm/0.33 μm, He; Program: 70C(1min) => 3C/min => 142C => 5C/min => 225C(10min)
CapillarySupelcowax-101230.Riu-Aumatell, Bosch-Fuste´, et al., 200630. m/0.25 mm/0.25 μm; Program: not specified
CapillaryDB-FFAP1226.Buettner and Mestres, 200530. m/0.32 mm/0.25 μm; Program: 35C(2min) => 40C/min => 60C(2min) => 6C/min => 180C => 10C/min=230C(10min)
CapillaryCP-Wax 52CB1235.Jales, Maia, et al., 2005Hydrogen; Program: not specified
CapillaryDB-Wax1236.Mattheis, Fan, et al., 200560. m/0.25 mm/0.25 μm, He; Program: 35C(5min) => 2C/min => 50C => 5C/min => 200C (5min)
CapillaryCP-Wax 58CB1216.Tokitomo, Steihaus, et al., 200525. m/0.32 mm/0.20 μm, Helium; Program: 40 0C (2 min) 40 0C/min -> 60 0C (1 min) 6 0C/min -> 180 0C 10 0C/min -> 240 0C (5 min)
CapillaryInnowax FSC1250.Baser, Özek, et al., 200460. m/0.25 mm/0.25 μm, He; Program: 60C(10min) => 4C/min => 220C(10min) => 1C/min => 240C
CapillaryDB-FFAP1226.Buettner, 200430. m/0.32 mm/0.25 μm, He; Program: 40C(2min) => 40C/min => 60C(2min) => 6C/min => 180C => 15C/min => 230C (10min)
CapillaryFFAP1243.Echeverría, Correa, et al., 200450. m/0.2 mm/0.33 μm, He; Program: 70C(1min) => 3C/min => 142C => 5C/min => 225C(10min)
CapillaryDB-Wax1259.Escudero, Gogorza, et al., 2004Program: not specified
CapillaryInnowax1250.Selli, Kürkçüoglu, et al., 200460. m/0.25 mm/0.25 μm, He; Program: 50C(10min) => 4C/min => 220C(10min) => 1C/min => 240C
CapillaryCarbowax 20M1223.Vinogradov, 2004Program: not specified
CapillaryHP-FFAP1243.Echeverria, Fuentes, et al., 200350. m/0.2 mm/0.33 μm, He; Program: 70C(1min) => 3C/min => 142C => 5C/min => 225C (10min)
CapillaryPEG-20M1222.Garruti, Franco, et al., 200330. m/0.25 mm/0.25 μm; Program: 50C(8min) => 4C/min => 110C => 16C/min => 200C
CapillaryCarbowax 20M1223.Krings, Banavara, et al., 2003Program: not specified
CapillaryCP-WAX 57CB1248.Martí, Mestres, et al., 200350. m/0.25 mm/0.2 μm, He; Program: 40C(10min) => 5C/min => 100C => 3C/min => 180C => 20C/min => 210C (10min)
CapillaryDB-Wax1224.Qian and Reineccius, 200360. m/0.32 mm/0.5 μm, He; Program: 35C(4min) => 2C/min => 130C => 4C/min => 250C
CapillaryDB-Wax1229.Selli, Cabaroglu, et al., 200330. m/0.32 mm/0.5 μm, He; Program: 60C(2min) => 2C/min => 220C => 3C/min => 245C(20min)
CapillaryCP-Wax 52CB1229.Escalona, Birkmyre, et al., 200230. m/0.25 mm/0.25 μm, He; Program: 50C(5min) => 7C/min => 180C => 10C/min => 240C(10min)
CapillarySupelcowax-101199.Rogerson and de Freitas, 200260. m/0.25 mm/0.25 μm, He; Program: 40C(20min) => (1.5C/min) => 200C => (10C/min) => 250C(120min)
CapillaryTRWAX1255.Torrens, 200260. m/0.25 mm/0.25 μm, He; Program: not specified
CapillaryCP-Wax 52CB1232.Escalona, Birkmyre, et al., 200130. m/0.25 mm/0.25 μm, He; Program: 50C(5min) => 7C/min => 180C => 10C/min => 240C(10min)
CapillaryNukol1217.López and Dufour, 2001N2; Column length: 25. m; Column diameter: 0.25 mm; Program: 45C(5min) => 20C/min => 100C(1min) => 3C/min => 190C(40min)
CapillaryDB-Wax1223.Miranda, Nogueira, et al., 200130. m/0.25 mm/0.25 μm, He; Program: 25 0C (0.5 min) 50 K/min -> 50 0C 3.5 K/min -> 150 0C 7.5 K/min -> 240 0C
CapillaryInnowax FSC1248.Saglam, Gozler, et al., 200160. m/0.25 mm/0.25 μm, He; Program: 60C(10min) => 4C/min => 220C(10min) => 1C/min => 240C
CapillaryCarbowax 20M1223.Teai, Claude-Lafontaine, et al., 200150. m/0.2 mm/0.2 μm, N2; Program: 60C => 2C/min => 150C => 4C/min => 220C
CapillaryFFAP1245.Lopez, Lavilla, et al., 200050. m/0.2 mm/0.33 μm, N2; Program: 70C(1min) => 3C/min => 142C(2min) => 25C/min => 230C(5min)
CapillaryDB-Wax1223.Paniandy, Chane-Ming, et al., 200060. m/0.32 mm/0.25 μm, Helium; Program: not specified
CapillaryFFAP1229.Lambert, Demazeau, et al., 199930. m/0.32 mm/0.25 μm; Program: not specified
CapillaryCross-linked FFAP1245.Lavilla, Puy, et al., 199950. m/0.2 mm/0.33 μm, N2; Program: 70C(1min) => 3C/min => 142C (2min) => 25C/min => 230C(5min)
CapillaryFFAP1245.López, Lavilla, et al., 199850. m/0.2 mm/0.33 μm, N2; Program: 70C (1min) => 3C/min => 142C (2min) => 25C/min => 230C (5min)
CapillaryPEG1238.Vas, Gal, et al., 199840. m/0.182 mm/0.30 μm, Hydrogen; Program: 35 0C (5 min) 5 0C/min -> 100 0C 3 0C/min -> 200 0C (1 min) 20 0C/min -> 240 0C (2 min)
CapillaryDB-FFAP1225.Guth, 199730. m/0.32 mm/0.25 μm; Program: 35C (1min) => 40C/min => 60C (1min) => 6C/min => 250C (10min)
CapillaryDB-FFAP1225.Guth, 199730. m/0.32 mm/0.25 μm; Program: 35C (1min) => 40C/min => 60C (1min) => 6C/min => 250C (10min)
CapillarySupelcowax-101223.Chang, Seitz, et al., 199530. m/0.32 mm/0.25 μm, He; Program: 50C(2min) => 7C/min => 140C => 17.5C/min => 230C
CapillaryDB-Wax1231.Mattheis, Buchanan, et al., 199260. m/0.25 mm/0.25 μm, He; Program: 35C (5min) => 2C/min => 50C => 5C/min => 200C(5min)
CapillarySupelcowax-101244.Miranda-Lopez, Libbey, et al., 199230. m/0.53 mm/0.25 μm; Program: 80C(5min) => 5C/min => 155C => 4C/min => 240C(30min)
CapillaryPolyethylene Glycol1235.Grundschober, 1991Program: not specified
CapillaryDB-Wax1246.Peng, Yang, et al., 1991Program: not specified
CapillaryDB-Wax1232.Binder and Flath, 1989Column length: 60. m; Column diameter: 0.32 mm; Program: not specified
CapillaryCarbowax 20M1223.Shibamoto, 1987Column length: 50. m; Column diameter: 0.25 mm; Program: not specified

Lee's RI, non-polar column, temperature ramp

View large format table.

Column type Active phase I Reference Comment
CapillaryDB-5159.0Donnelly, Abdel-Hamid, et al., 199330. m/0.32 mm/0.25 μm, He, 40. C @ 3. min, 8. K/min, 285. C @ 29.5 min

References

Wiberg and Waldron, 1991
Wiberg, K.B.; Waldron, R.F.,
Lactones. 2. Enthalpies of hydrolysis, reduction, and formation of the C4-C13 monocyclic lactones. strain energies and conformations,
J. Am. Chem. Soc., 1991, 113, 7697-7705. [all data]
Weast and Grasselli, 1989
CRC Handbook of Data on Organic Compounds, 2nd Editon, Weast,R.C and Grasselli, J.G., ed(s)., CRC Press, Inc., Boca Raton, FL, 1989, 1. [all data]
Serijan and Wise, 1951
Serijan, K.T.; Wise, P.H.,
Dicyclic hydrocarboms. IV. Synthesis and Physical properties of alpha,alpha - and alpha,omega-diphenyl- and dicyclohexyl- pentanes and hexanes,
J. Am. Chem. Soc., 1951, 73, 5191. [all data]
Gill and Dexter, 1934
Gill, A.H.; Dexter, F.P.,
Ind. Eng. Chem., 1934, 26, 881. [all data]
Gartenmeister, 1886
Gartenmeister, R.,
Investigation of the physical characterstics of liquid compounds: vi boiling point and specific volume of normal fatty acid esters,
Justus Liebigs Ann. Chem., 1886, 233, 249-315. [all data]
Fehling, 1845
Fehling, H.,
Acids of Coconut Oil,
Justus Liebigs Ann. CHem., 1845, 53, 399-411. [all data]
Young, 1994
Young, C.L.,
Personal Commun. 1994 1994, 1994. [all data]
Verevkin and Heintz, 1999
Verevkin, Sergey P.; Heintz, Andreas,
Determination of Vaporization Enthalpies of the Branched Esters from Correlation Gas Chromatography and Transpiration Methods,
J. Chem. Eng. Data, 1999, 44, 6, 1240-1244, https://doi.org/10.1021/je990122a
. [all data]
Nilsson and Wadso, 1986
Nilsson, S.-O.; Wadso, I.,
Thermodynamic properties of some mono-, di-, and tri esters. Enthalpies of solution in water at 288.15 to 318.15 K and enthalpies of vaporization and heat capacities at 298.15 K,
J. Chem. Thermodyn., 1986, 18, 673-681. [all data]
Stephenson and Malanowski, 1987
Stephenson, Richard M.; Malanowski, Stanislaw,
Handbook of the Thermodynamics of Organic Compounds, 1987, https://doi.org/10.1007/978-94-009-3173-2
. [all data]
Holmes and Lossing, 1980
Holmes, J.L.; Lossing, F.P.,
Gas-phase heats of formation of keto and enol ions of carbonyl compounds.,
J. Am. Chem. Soc., 1980, 102, 1591. [all data]