Hydroquinone
- Formula: C6H6O2
- Molecular weight: 110.1106
- IUPAC Standard InChIKey: QIGBRXMKCJKVMJ-UHFFFAOYSA-N
- CAS Registry Number: 123-31-9
- Chemical structure:
View 3d structure (requires JavaScript / HTML 5) - Other names: 1,4-Benzenediol; p-Benzenediol; p-Dihydroxybenzene; p-Dioxybenzene; p-Hydroquinone; p-Hydroxyphenol; Arctuvin; Benzohydroquinone; Benzoquinol; Diak 5; Eldopaque; Eldoquin; Hidroquinone; Hydroquinol; HE 5; Phiaquin; Quinol; Tecquinol; Tenox HQ; 1,4-Dihydroxybenzene; 4-Hydroxyphenol; p-Dioxobenzene; Hydrochinone; Benzene, p-dihydroxy-; Black and White Bleaching Cream; Derma-Blanch; Hydrochinon; Hydroquinole; Idrochinone; NCI-C55834; Tequinol; USAF EK-356; 1,4-Dihydroxy-benzeen; 1,4-Dihydroxy-benzol; 1,4-Dihydroxybenzen; 1,4-Diidrobenzene; UN 2662; Dihydroquinone; Aida; Eldopacque; Eldopaque forte; Eldoquin forte; Solaquin forte; p-Dihydroquinone; Black & White Bleaching Cream; 1,4-Benzenediol (hydroquinone); Artra (Salt/Mix)

Gas phase thermochemistry data

Data compiled as indicated in comments:
ALS - Hussein Y. Afeefy, Joel F. Liebman, and Stephen E. Stein
DRB - Donald R. Burgess, Jr.
GT - Glushko Thermocenter, Russian Academy of Sciences, Moscow
Quantity | Value | Units | Method | Reference | Comment |
---|---|---|---|---|---|
ΔfH°gas | -277.0 ± 1.4 | kJ/mol | Ccr | Sabbah and Buluku, 1991 | ΔHfusion =21.09±0.4 kJ/mol; ALS |
ΔfH°gas | -272.0 | kJ/mol | N/A | Pilcher and Sutton, 1956 | Value computed using ΔfHsolid° value of -366.1±1.2 kj/mol from Pilcher and Sutton, 1956 and ΔsubH° value of 94.1 kj/mol from Sabbah and Buluku, 1991.; DRB |
ΔfH°gas | -268.9 | kJ/mol | N/A | Parks, Manchester, et al., 1954 | Value computed using ΔfHsolid° value of -363.0±1.0 kj/mol from Parks, Manchester, et al., 1954 and ΔsubH° value of 94.1 kj/mol from Sabbah and Buluku, 1991.; DRB |
ΔfH°gas | -266.9 | kJ/mol | N/A | Pushin, 1954 | Value computed using ΔfHsolid° value of -361.0 kj/mol from Pushin, 1954 and ΔsubH° value of 94.1 kj/mol from Sabbah and Buluku, 1991.; DRB |
ΔfH°gas | -268.4 | kJ/mol | N/A | Schreiner, 1925 | Value computed using ΔfHsolid° value of -362.5 kj/mol from Schreiner, 1925 and ΔsubH° value of 94.1 kj/mol from Sabbah and Buluku, 1991.; DRB |
Quantity | Value | Units | Method | Reference | Comment |
S°gas | 343.1 ± 5.0 | J/mol*K | N/A | Kudchadker S.A., 1979 | GT |
Constant pressure heat capacity of gas
Cp,gas (J/mol*K) | Temperature (K) | Reference | Comment |
---|---|---|---|
34.52 | 50. | Kudchadker S.A., 1979 | GT |
47.69 | 100. | ||
66.48 | 150. | ||
86.13 | 200. | ||
114.40 | 273.15 | ||
123.60 | 298.15 | ||
124.27 | 300. | ||
157.14 | 400. | ||
183.26 | 500. | ||
203.62 | 600. | ||
219.74 | 700. | ||
232.82 | 800. | ||
243.67 | 900. | ||
252.83 | 1000. | ||
260.64 | 1100. | ||
267.36 | 1200. | ||
273.17 | 1300. | ||
278.22 | 1400. | ||
282.61 | 1500. |

Condensed phase thermochemistry data

Data compiled as indicated in comments:
ALS - Hussein Y. Afeefy, Joel F. Liebman, and Stephen E. Stein
DH - Eugene S. Domalski and Elizabeth D. Hearing
Quantity | Value | Units | Method | Reference | Comment |
---|---|---|---|---|---|
ΔfH°solid | -371.1 ± 1.3 | kJ/mol | Ccr | Sabbah and Buluku, 1991 | ΔHfusion =21.09±0.4 kJ/mol; ALS |
ΔfH°solid | -366.1 ± 1.2 | kJ/mol | Ccb | Pilcher and Sutton, 1956 | ALS |
ΔfH°solid | -363.0 ± 1.0 | kJ/mol | Ccb | Parks, Manchester, et al., 1954 | ALS |
ΔfH°solid | -361. | kJ/mol | Ccb | Pushin, 1954 | Author's hf298_condensed=-87.8 kcal/mol; ALS |
ΔfH°solid | -362.5 | kJ/mol | Ccb | Schreiner, 1925 | ALS |
Quantity | Value | Units | Method | Reference | Comment |
ΔcH°solid | -2850. ± 20. | kJ/mol | AVG | N/A | Average of 8 values; Individual data points |
Constant pressure heat capacity of solid
Cp,solid (J/mol*K) | Temperature (K) | Reference | Comment |
---|---|---|---|
131.90 | 298.15 | Bret-Dibat and Lichanot, 1989 | T = 200 to 500 K. Cp(c) = 125.328 + 0.2791t - 1.0329x10-3t2 + 1.5075x10-5t3 J/mol*K (t/°C). Cp value caluculated from equation.; DH |
136.4 | 298.15 | Ueberreiter and Orthmann, 1950 | T = 293 to 368 K. Equation only.; DH |
150.2 | 323. | Satoh and Sogabe, 1941 | T = 0 to 100°C. Mean value.; DH |
139.7 | 298. | Andrews, Lynn, et al., 1926 | T = 22 to 200°C.; DH |
133.5 | 297.9 | Andrews, 1926 | T = 110 to 344 K. Value is unsmoothed experimental datum.; DH |
130.5 | 274.3 | Lange, 1924 | T = 28 to 275 K. Value is unsmoothed experimental datum.; DH |

Phase change data

Data compiled as indicated in comments:
BS - Robert L. Brown and Stephen E. Stein
TRC - Thermodynamics Research Center, NIST Boulder Laboratories, Chris Muzny director
AC - William E. Acree, Jr., James S. Chickos
ALS - Hussein Y. Afeefy, Joel F. Liebman, and Stephen E. Stein
DRB - Donald R. Burgess, Jr.
DH - Eugene S. Domalski and Elizabeth D. Hearing
Quantity | Value | Units | Method | Reference | Comment |
---|---|---|---|---|---|
Tboil | 558.2 | K | N/A | Aldrich Chemical Company Inc., 1990 | BS |
Tboil | 558.2 | K | N/A | Krupatkin and Rozhentsova, 1971 | Uncertainty assigned by TRC = 1. K; TRC |
Quantity | Value | Units | Method | Reference | Comment |
Tfus | 445.0 | K | N/A | Bret-Dibat and Lichanot, 1989, 2 | Crystal phase 1 phase; Uncertainty assigned by TRC = 0.6 K; TRC |
Tfus | 445. | K | N/A | Buckingham and Donaghy, 1982 | BS |
Tfus | 443.5 | K | N/A | Krupatkin and Rozhentsova, 1971 | Uncertainty assigned by TRC = 0.3 K; TRC |
Quantity | Value | Units | Method | Reference | Comment |
Ttriple | 445.98 | K | N/A | Sabbah and Buluku, 1991, 2 | Uncertainty assigned by TRC = 0.03 K; TRC |
Ttriple | 445.5 | K | N/A | Andrews, Lynn, et al., 1926, 2 | Uncertainty assigned by TRC = 0.3 K; obtained from cooling curve in absence of air; TRC |
Quantity | Value | Units | Method | Reference | Comment |
ΔvapH° | 84.4 ± 0.7 | kJ/mol | N/A | Verevkin and Kozlova, 2008 | AC |
Quantity | Value | Units | Method | Reference | Comment |
ΔsubH° | 94.13 ± 0.53 | kJ/mol | C | Sabbah and Buluku, 1991 | ΔHfusion =21.09±0.4 kJ/mol; ALS |
ΔsubH° | 94.1 | kJ/mol | N/A | Sabbah and Buluku, 1991 | DRB |
ΔsubH° | 94.1 ± 0.5 | kJ/mol | C | Sabbah and Buluku, 1991 | AC |
ΔsubH° | 99.2 ± 1.7 | kJ/mol | C | Magnus, 1956 | Reanalyzed by Cox and Pilcher, 1970, Original value = 104. kJ/mol; ALS |
ΔsubH° | 103.76 | kJ/mol | V | Coolidge and Coolidge, 1927 | ALS |
Reduced pressure boiling point
Tboil (K) | Pressure (bar) | Reference | Comment |
---|---|---|---|
558.2 | 0.973 | Weast and Grasselli, 1989 | BS |
558. | 0.973 | Buckingham and Donaghy, 1982 | BS |
Enthalpy of vaporization
ΔvapH (kJ/mol) | Temperature (K) | Method | Reference | Comment |
---|---|---|---|---|
70.5 | 463. | A | Stephenson and Malanowski, 1987 | Based on data from 448. to 559. K.; AC |
Antoine Equation Parameters
log10(P) = A − (B / (T + C))
P = vapor pressure (bar)
T = temperature (K)
View plot Requires a JavaScript / HTML 5 canvas capable browser.
Temperature (K) | A | B | C | Reference | Comment |
---|---|---|---|---|---|
432.3 to 559. | 5.8947 | 3049.481 | -40.485 | von Terres, Gebert, et al., 1955 | Coefficents calculated by NIST from author's data. |
Enthalpy of sublimation
ΔsubH (kJ/mol) | Temperature (K) | Method | Reference | Comment |
---|---|---|---|---|
100.6 ± 1.3 | 332. | N/A | Chen, Oja, et al., 2006 | Based on data from 325. to 339. K.; AC |
93.7 ± 0.5 | 334. | C | Sabbah and Buluku, 1991 | AC |
101.3 | 341. to 400. | GS | Bender, Bieling, et al., 1983 | AC |
104. ± 1. | 342. | ME,TE | de Kruif, 1981 | AC |
103.8 | 313. | N/A | Magnus, 1956 | Based on data from 298. to 346. K.; AC |
99. ± 2. | 351. | V | Wolf and Weghofer, 1938 | ALS |
103.8 | 326. to 345. | QF | Coolidge and Coolidge, 1927 | AC |
Enthalpy of fusion
ΔfusH (kJ/mol) | Temperature (K) | Method | Reference | Comment |
---|---|---|---|---|
26.500 | 444.95 | N/A | Bret-Dibat and Lichanot, 1989 | DH |
27.23 | 445.1 | N/A | Verevkin and Kozlova, 2008 | AC |
26.48 | 453. | N/A | Bret-Dibat and Lichanot, 1989 | AC |
27.110 | 445.5 | N/A | Andrews, Lynn, et al., 1926 | DH |
27.11 | 445.1 | C | Andrews, Lynn, et al., 1926 | AC |
Entropy of fusion
ΔfusS (J/mol*K) | Temperature (K) | Reference | Comment |
---|---|---|---|
59. | 444.95 | Bret-Dibat and Lichanot, 1989 | DH |
60.9 | 445.5 | Andrews, Lynn, et al., 1926 | DH |

Reaction thermochemistry data

Data compiled by: John E. Bartmess
Individual Reactions
C6H5O2- + =
By formula: C6H5O2- + H+ = C6H6O2
Quantity | Value | Units | Method | Reference | Comment |
---|---|---|---|---|---|
ΔrH° | 1466. ± 8.8 | kJ/mol | G+TS | Fujio, McIver, et al., 1981 | gas phase; value altered from reference due to change in acidity scale |
Quantity | Value | Units | Method | Reference | Comment |
ΔrG° | 1436. ± 8.4 | kJ/mol | IMRE | Fujio, McIver, et al., 1981 | gas phase; value altered from reference due to change in acidity scale |

Henry's Law data

Data compiled by: Rolf Sander
Henry's Law constant (water solution)
kH(T) = k°H exp(d(ln(kH))/d(1/T) ((1/T) - 1/(298.15 K)))
k°H = Henry's law constant for solubility in water at 298.15 K (mol/(kg*bar))
d(ln(kH))/d(1/T) = Temperature dependence constant (K)
k°H (mol/(kg*bar)) | d(ln(kH))/d(1/T) (K) | Method | Reference |
---|---|---|---|
2.5×10+7 | V | N/A | |
2.6×10+7 | X | N/A | |
1.7×10+7 | X | N/A |

Gas phase ion energetics data

Data evaluated as indicated in comments:
L - Sharon G. Lias
Data compiled as indicated in comments:
B - John E. Bartmess
LBLHLM - Sharon G. Lias, John E. Bartmess, Joel F. Liebman, John L. Holmes, Rhoda D. Levin, and W. Gary Mallard
LLK - Sharon G. Lias, Rhoda D. Levin, and Sherif A. Kafafi
Quantity | Value | Units | Method | Reference | Comment |
---|---|---|---|---|---|
IE (evaluated) | 7.94 ± 0.01 | eV | N/A | N/A | L |
Ionization energy determinations
IE (eV) | Method | Reference | Comment |
---|---|---|---|
7.93 ± 0.01 | S | Oikawa, Abe, et al., 1985 | LBLHLM |
7.95 ± 0.05 | PI | Potapov, Kardash, et al., 1972 | LLK |
7.95 ± 0.03 | PI | Potapov and Sorokin, 1971 | LLK |
8.44 | PE | Palmer, Moyes, et al., 1979 | Vertical value; LLK |
De-protonation reactions
C6H5O2- + =
By formula: C6H5O2- + H+ = C6H6O2
Quantity | Value | Units | Method | Reference | Comment |
---|---|---|---|---|---|
ΔrH° | 1466. ± 8.8 | kJ/mol | G+TS | Fujio, McIver, et al., 1981 | gas phase; value altered from reference due to change in acidity scale; B |
Quantity | Value | Units | Method | Reference | Comment |
ΔrG° | 1436. ± 8.4 | kJ/mol | IMRE | Fujio, McIver, et al., 1981 | gas phase; value altered from reference due to change in acidity scale; B |

Kovats' RI, non-polar column, isothermal

Column type | Active phase | Temperature (C) | I | Reference | Comment |
---|---|---|---|---|---|
Packed | OV-1 | 180. | 1327. | Radecki and Grzybowski, 1978 | Chromosorb W HMDS (100-120 mesh); Column length: 2.1 m |

Kovats' RI, non-polar column, custom temperature program

Column type | Active phase | I | Reference | Comment |
---|---|---|---|---|
Packed | SE-30 | 1334. | Grzybowski, Lamparczyk, et al., 1980 | Chromosorb W HMDS (80-100 mesh); Column length: 2.9 m; Program: not specified |

Van Den Dool and Kratz RI, polar column, temperature ramp

Column type | Active phase | I | Reference | Comment |
---|---|---|---|---|
Capillary | DB-Wax | 2693. | Shiratsuchi, Shimoda, et al., 1993 | 60. m/0.25 mm/0.25 μm, 50. C @ 4. min, 2. K/min, 230. C @ 30. min |
Capillary | DB-Wax | 2693. | Shiratsuchi, Shimoda, et al., 1993 | 60. m/0.25 mm/0.25 μm, 50. C @ 4. min, 2. K/min, 230. C @ 30. min |

Normal alkane RI, non-polar column, custom temperature program

Column type | Active phase | I | Reference | Comment |
---|---|---|---|---|
Capillary | HP-5 MS | 1241. | Xian, Chen, et al., 2006 | 30. m/0.25 mm/0.25 μm, Helium; Program: 40 0C (3 min) 6 0C/min -> 150 0C (1 min) 10 0C/min -> 250 0C (10 min) |
Capillary | SE-30 | 1334. | Peterson, 1992 | Program: not specified |

Lee's RI, non-polar column, temperature ramp

Column type | Active phase | I | Reference | Comment |
---|---|---|---|---|
Capillary | HP-5 | 220.6 | Wang, Hou, et al., 2007 | 30. m/0.30 mm/0.25 μm, Helium, 50. C @ 5. min, 5. K/min, 200. C @ 15. min |
Capillary | DB-5 | 207.49 | Williams and Horne, 1995 | He, 60. C @ 2. min, 5. K/min; Column length: 25. m; Column diameter: 0.3 mm; Tend: 270. C |

References

Sabbah and Buluku, 1991
Sabbah, R.; Buluku, E.N.L.E.,
Thermodynamic study of three isomers of dihydroxybenzene,
Can. J. Chem., 1991, 69, 481-488. [all data]
Pilcher and Sutton, 1956
Pilcher, G.; Sutton, L.E.,
The heats of combustion of quinol and p-benzoquinone and the thermodynamic quantities of the oxidation-reduction reaction,
J. Chem. Soc., 1956, 2695-2700. [all data]
Parks, Manchester, et al., 1954
Parks, G.S.; Manchester, K.E.; Vaughan, L.M.,
Heats of combustion and formation of some alcohols, phenols, and ketones,
J. Chem. Phys., 1954, 22, 2089-2090. [all data]
Pushin, 1954
Pushin, N.A.,
Heats of combustion and heats of formation of isomeric organic compounds,
Bull. Soc. Chim. Belgrade, 1954, 19, 531-547. [all data]
Schreiner, 1925
Schreiner, E.,
Thermodynamics of the quinhydrone electrode and the chemical constant of hydrogen,
Z. Phys. Chem., 1925, 117, 57-87. [all data]
Kudchadker S.A., 1979
Kudchadker S.A.,
Ideal gas thermodynamic properties of benzene diols: pyrocatechol, resorcinol, and hydroquinone,
Thermochim. Acta, 1979, 30, 319-326. [all data]
Bret-Dibat and Lichanot, 1989
Bret-Dibat, P.; Lichanot, A.,
Thermodynamic properties of positional isomers of disubstituted benzene in condensed phase,
Thermochim. Acta, 1989, 147(2), 261-271. [all data]
Ueberreiter and Orthmann, 1950
Ueberreiter, K.; Orthmann, H.-J.,
Specifische Wärme, spezifisches Volumen, Temperatur- und Wärme-leittähigkeit einiger disubstituierter Benzole und polycyclischer Systeme,
Z. Natursforsch. 5a, 1950, 101-108. [all data]
Satoh and Sogabe, 1941
Satoh, S.; Sogabe, T.,
The heat capacities of some organic compounds containing nitrogen and the atomic heat of nitrogen. (3), Sci.,
Pap. Inst. Phys. Chem. Res. (Tokyo), 1941, 38, 238-245. [all data]
Andrews, Lynn, et al., 1926
Andrews, D.H.; Lynn, G.; Johnston, J.,
The heat capacities and heat of crystallization of some isomeric aromatic compounds,
J. Am. Chem. Soc., 1926, 48, 1274-1287. [all data]
Andrews, 1926
Andrews, D.H.,
The specific heats of some isomers of the type ortho, meta and para C6H4XY from 110 to 340K,
J. Am. Chem. Soc., 1926, 48, 1287-1298. [all data]
Lange, 1924
Lange, F.,
Untersuchungen über die spezifische Wärme bei tiefen Temperaturen,
Z. Phys. Chem., 1924, 110, 343-362. [all data]
Aldrich Chemical Company Inc., 1990
Aldrich Chemical Company Inc.,
Catalog Handbook of Fine Chemicals, Aldrich Chemical Company, Inc., Milwaukee WI, 1990, 1. [all data]
Krupatkin and Rozhentsova, 1971
Krupatkin, I.L.; Rozhentsova, E.P.,
Some properties of systems with latent liquid immiscibility,
Russ. J. Phys. Chem. (Engl. Transl.), 1971, 45, 1700. [all data]
Bret-Dibat and Lichanot, 1989, 2
Bret-Dibat, P.; Lichanot, A.,
Proprietes thermodynamiques des isomeres de position de benzenes disubstitues en phase condensee,
Thermochim. Acta, 1989, 147, 2, 261, https://doi.org/10.1016/0040-6031(89)85181-0
. [all data]
Buckingham and Donaghy, 1982
Buckingham, J.; Donaghy, S.M.,
Dictionary of Organic Compounds: Fifth Edition, Chapman and Hall, New York, 1982, 1. [all data]
Sabbah and Buluku, 1991, 2
Sabbah, R.; Buluku, E.N.L.E.,
Thermodynamic stury of the three isomers of dihydroxybenzene,
Can. J. Chem., 1991, 69, 481. [all data]
Andrews, Lynn, et al., 1926, 2
Andrews, D.H.; Lynn, G.; Johnston, J.,
The Heat Capacities and Heat of Crystallization of Some Isomeric Aromatic Compounds,
J. Am. Chem. Soc., 1926, 48, 1274. [all data]
Verevkin and Kozlova, 2008
Verevkin, Sergey P.; Kozlova, Svetlana A.,
Di-hydroxybenzenes: Catechol, resorcinol, and hydroquinone,
Thermochimica Acta, 2008, 471, 1-2, 33-42, https://doi.org/10.1016/j.tca.2008.02.016
. [all data]
Magnus, 1956
Magnus, A.,
Die resonanzenergien der parachinone Aui grund der prazisionsmessungsen ihrer verbrennungswarmen durch herrn gerhard wittwer,
Z. Phys. Chem. (Neue Folge), 1956, 9, 141-161. [all data]
Cox and Pilcher, 1970
Cox, J.D.; Pilcher, G.,
Thermochemistry of Organic and Organometallic Compounds, Academic Press, New York, 1970, 1-636. [all data]
Coolidge and Coolidge, 1927
Coolidge, A.S.; Coolidge, M.S.,
The sublimation pressures of substituted quinones and hydroquinones,
J. Am. Chem. Soc., 1927, 49, 100-104. [all data]
Weast and Grasselli, 1989
CRC Handbook of Data on Organic Compounds, 2nd Editon, Weast,R.C and Grasselli, J.G., ed(s)., CRC Press, Inc., Boca Raton, FL, 1989, 1. [all data]
Stephenson and Malanowski, 1987
Stephenson, Richard M.; Malanowski, Stanislaw,
Handbook of the Thermodynamics of Organic Compounds, 1987, https://doi.org/10.1007/978-94-009-3173-2
. [all data]
von Terres, Gebert, et al., 1955
von Terres, E.; Gebert, F.; Hulsemann, H.; Petereit, H.; Toepsch, H.; Ruppert, W.,
Zur Kenntnis der physikalisch-chemischen Grundlagen der Gewinnung und Zerlegung der Phenolfraktionen von Steinkohlenteer und Braunkohlenschwelteer. IV. Mitteilung Die Dampfdrucke von Phenol und Phenolderivaten,
Brennst.-Chem., 1955, 36, 272-274. [all data]
Chen, Oja, et al., 2006
Chen, Xu; Oja, Vahur; Chan, W. Geoffrey; Hajaligol, Mohammad R.,
Vapor Pressure Characterization of Several Phenolics and Polyhydric Compounds by Knudsen Effusion Method,
J. Chem. Eng. Data, 2006, 51, 2, 386-391, https://doi.org/10.1021/je050293h
. [all data]
Bender, Bieling, et al., 1983
Bender, R.; Bieling, V.; Maurer, G.,
The vapour pressures of solids: anthracene, hydroquinone, and resorcinol,
The Journal of Chemical Thermodynamics, 1983, 15, 6, 585-594, https://doi.org/10.1016/0021-9614(83)90058-7
. [all data]
de Kruif, 1981
de Kruif, C.G.,
Thermodynamic properties of 1,4-benzoquinone (BQ), 1,4-hydroquinone (HQ), 1,4-naphthoquinone (NQ), 1,4-naphthohydroquinone (NHQ), and the complexes BQ--HQ 1:1, NQ--HQ 1:1, NQ--NHQ 2:1, and NQ--NHQ 1:1,
J. Chem. Phys., 1981, 74, 10, 5838, https://doi.org/10.1063/1.440898
. [all data]
Wolf and Weghofer, 1938
Wolf, K.L.; Weghofer, H.,
Uber sublimationswarmen,
Z. Phys. Chem., 1938, 39, 194-208. [all data]
Fujio, McIver, et al., 1981
Fujio, M.; McIver, R.T., Jr.; Taft, R.W.,
Effects on the acidities of phenols from specific substituent-solvent interactions. Inherent substituent parameters from gas phase acidities,
J. Am. Chem. Soc., 1981, 103, 4017. [all data]
Oikawa, Abe, et al., 1985
Oikawa, A.; Abe, H.; Mikami, N.; Ito, M.,
Electronic spectra and ionization potentials of rotational isomers of severaldDisubstituted benzenes,
Chem. Phys. Lett., 1985, 116, 50. [all data]
Potapov, Kardash, et al., 1972
Potapov, V.K.; Kardash, I.E.; Sorokin, V.V.; Sokolov, S.A.; Evlasheva, T.I.,
Photoionization of heteroaromatic compounds,
Khim. Vys. Energ., 1972, 6, 392. [all data]
Potapov and Sorokin, 1971
Potapov, V.K.; Sorokin, V.V.,
Photoionization and ion-molecule reactions in quinones and alcohols,
High Energy Chem., 1971, 5, 435, In original 487. [all data]
Palmer, Moyes, et al., 1979
Palmer, M.H.; Moyes, W.; Speirs, M.; Ridyard, J.N.A.,
The electronic structure of substituted benzenes; ab initio calculations and photoelectron spectra for phenol, the methyl- and fluoro-derivatives, and the dihydroxybenzenes,
J. Mol. Struct., 1979, 52, 293. [all data]
Kiss, Molnar, et al., 1949
Kiss, A.; Molnar, J.; Sandorfy, C.,
Les spectres d'absorption des derives phenoliques,
Bull. Soc. Chim. Fr., 1949, 16, 275-280. [all data]
Radecki and Grzybowski, 1978
Radecki, A.; Grzybowski, J.,
Linear relationship between retention indices and chemical structure of phenols,
J. Chromatogr., 1978, 152, 1, 211-213, https://doi.org/10.1016/S0021-9673(00)85352-2
. [all data]
Grzybowski, Lamparczyk, et al., 1980
Grzybowski, J.; Lamparczyk, H.; Nasal, A.; Radecki, A.,
Relationship between the retention indices of phenols on polar and non-polar stationary phases,
J. Chromatogr., 1980, 196, 2, 217-223, https://doi.org/10.1016/S0021-9673(00)80441-0
. [all data]
Shiratsuchi, Shimoda, et al., 1993
Shiratsuchi, H.; Shimoda, M.; Minegishi, Y.; Osajima, Y.,
Isolation and identification of volatile flavor compounds in nonfermented coarse-cut sausage. Flavor as a quality factor of nonfermented sausage. 1,
J. Agric. Food Chem., 1993, 41, 4, 647-652, https://doi.org/10.1021/jf00028a027
. [all data]
Xian, Chen, et al., 2006
Xian, Q.-M.; Chen, H.-D.; Zou, H.-H.,
Allelopathic activity of volatile substance from submerged macrophytes on Microcystin aeruginosa,
Acta Ecologica Sinica, 2006, 26, 11, 3549-3554, https://doi.org/10.1016/S1872-2032(06)60054-1
. [all data]
Peterson, 1992
Peterson, K.L.,
Counter-Propagation Neural Networks in the Modeling and Prediction of Kovats Indices for Substituted Phenols,
Anal. Chem., 1992, 64, 4, 379-386, https://doi.org/10.1021/ac00028a011
. [all data]
Wang, Hou, et al., 2007
Wang, G.; Hou, Z.; Sun, Y.; Liu, Y.; Xie, B.; Liu, S.,
Investigation of pyrolysis behavior of fenoxycarb using PY-GC-MS assisted with chemometric methods,
Chem. Anal., 2007, 52, 141-156. [all data]
Williams and Horne, 1995
Williams, P.T.; Horne, P.A.,
Analysis of aromatic hydrocarbons in pyrolytic oil derived from biomass,
J. Anal. Appl. Pyrolysis, 1995, 31, 15-37, https://doi.org/10.1016/0165-2370(94)00814-H
. [all data]