Pentanal, 2-methyl-
- Formula: C6H12O
- Molecular weight: 100.1589
- IUPAC Standard InChIKey: FTZILAQGHINQQR-UHFFFAOYSA-N
- CAS Registry Number: 123-15-9
- Chemical structure:
View 3d structure (requires JavaScript / HTML 5) - Stereoisomers:
- Other names: Valeraldehyde, 2-methyl-; α-Methylpentanal; 2-Formylpentane; 2-Methylpentanal; 2-Methylvaleraldehyde; n-C3H7CH(CH3)CHO; 2-Methyl-n-valeraldehyde; 2-Methylpental; 2-Methylpentaldehyde; α-Methyl valeraldehyde; UN 2367; 2-Methylvaleric aldehyde; NSC 49351

Phase change data

Data compiled as indicated in comments:
BS - Robert L. Brown and Stephen E. Stein
TRC - Thermodynamics Research Center, NIST Boulder Laboratories, Chris Muzny director
Quantity | Value | Units | Method | Reference | Comment |
---|---|---|---|---|---|
Tboil | 391. ± 3. | K | AVG | N/A | Average of 8 values; Individual data points |

Gas phase ion energetics data

Data compiled by: Sharon G. Lias, Rhoda D. Levin, and Sherif A. Kafafi
Ionization energy determinations
IE (eV) | Method | Reference |
---|---|---|
9.70 | EI | Morgan, Derrick, et al., 1980 |
Appearance energy determinations
Ion | AE (eV) | Other Products | Method | Reference | Comment |
---|---|---|---|---|---|
C3H6+ | 11.00 | C3H6O | EI | Morgan, Derrick, et al., 1980 | |
C3H6O+ | 10.30 | C3H6 | EI | Morgan, Derrick, et al., 1980 | |
C3H6O+ | 9.80 | C3H6 | EI | Holmes and Lossing, 1980 | |
C4H8O+ | 10.60 | C2H4 | EI | Morgan, Derrick, et al., 1980 |

Kovats' RI, non-polar column, temperature ramp

Column type | Active phase | I | Reference | Comment |
---|---|---|---|---|
Capillary | DB-1 | 736. | Takeoka, Perrino, et al., 1996 | 60. m/0.25 mm/0.25 μm, 30. C @ 4. min, 2. K/min; Tend: 220. C |
Capillary | DB-1 | 745. | Takeoka, Perrino, et al., 1996 | 60. m/0.25 mm/0.25 μm, 30. C @ 4. min, 2. K/min; Tend: 220. C |

Van Den Dool and Kratz RI, non-polar column, temperature ramp

Column type | Active phase | I | Reference | Comment |
---|---|---|---|---|
Capillary | DB-5 | 745.8 | Xu, van Stee, et al., 2003 | 30. m/0.25 mm/1. μm, He, 2.5 K/min; Tstart: 50. C; Tend: 200. C |
Capillary | OV-1 | 740. | Schreyen, Dirinck, et al., 1976 | N2, 1. K/min; Column length: 183. m; Tstart: 0. C; Tend: 230. C |

Normal alkane RI, non-polar column, temperature ramp

Column type | Active phase | I | Reference | Comment |
---|---|---|---|---|
Capillary | DB-1 | 777. | Hanum, Sinha, et al., 1995 | 30. m/0.25 mm/0.25 μm, He, 5. K/min; Tstart: 35. C; Tend: 150. C |

Normal alkane RI, non-polar column, custom temperature program

Column type | Active phase | I | Reference | Comment |
---|---|---|---|---|
Capillary | HP-5 | 758. | Fang, Pu, et al., 2012 | 30. m/0.25 mm/0.25 μm, Helium; Program: 30 0C (1 min) 2 0C/min -> 100 0C (5 min) 5 0C/min -> 170 0C |
Capillary | HP-5 | 760. | Splivallo, Bossi, et al., 2007 | He; Program: 50C => 3C/min => 200C(10min) => 10C/min => 290C(10min) |
Capillary | HP-5 MS | 791. | Pyun and Shin, 2006 | 30. m/0.25 mm/0.25 μm; Program: 40 0C (3 min) 2 0C/min -> 150 0C 20 0C/min -> 220 0C (5 min) |
Capillary | SE-30 | 760. | Vinogradov, 2004 | Program: not specified |
Capillary | Methyl Silicone | 746. | Misharina, 1995 | Program: not specified |
Capillary | DB-1 | 725. | Ciccioli, Cecinato, et al., 1994 | 60. m/0.32 mm/0.25 μm; Program: not specified |
Capillary | DB-1 | 725. | Ciccioli, Brancaleoni, et al., 1993 | 60. m/0.32 mm/0.25 μm; Program: 3 min at 5 C; 5 - 50 C at 3 deg/min; 50 - 220 C at 5 deg/min |
Capillary | CP Sil 8 CB | 762. | Weller and Wolf, 1989 | 40. m/0.25 mm/0.25 μm, He; Program: 30 0C (1 min) 15 0C/min -> 45 0C 3 0C/min -> 120 0C |

References

Morgan, Derrick, et al., 1980
Morgan, R.P.; Derrick, P.J.; Loudon, A.G.,
Kinetics and mechanisms of the decompositions of the molecular ions of pentanal and its monomethyl- substituted homologues in the picosecond to microsecond time interval following field ionization,
J. Chem. Soc. Perkin Trans. 2, 1980, 306. [all data]
Holmes and Lossing, 1980
Holmes, J.L.; Lossing, F.P.,
Gas-phase heats of formation of keto and enol ions of carbonyl compounds.,
J. Am. Chem. Soc., 1980, 102, 1591. [all data]