Phenol, 4-ethyl-
- Formula: C8H10O
- Molecular weight: 122.1644
- IUPAC Standard InChIKey: HXDOZKJGKXYMEW-UHFFFAOYSA-N
- CAS Registry Number: 123-07-9
- Chemical structure:
View 3d structure (requires JavaScript / HTML 5) - Other names: Phenol, p-ethyl-; p-Ethylphenol; 1-Ethyl-4-hydroxybenzene; 4-Ethylphenol; 1-Hydroxy-4-ethylbenzene; Paraethylphenol

Gas phase thermochemistry data

Data compiled by: Hussein Y. Afeefy, Joel F. Liebman, and Stephen E. Stein
Quantity | Value | Units | Method | Reference | Comment |
---|---|---|---|---|---|
ΔfH°gas | -144.3 ± 1.1 | kJ/mol | Ccb | Biddiscombe, Handley, et al., 1963 |

Condensed phase thermochemistry data

Data compiled as indicated in comments:
ALS - Hussein Y. Afeefy, Joel F. Liebman, and Stephen E. Stein
DH - Eugene S. Domalski and Elizabeth D. Hearing
Quantity | Value | Units | Method | Reference | Comment |
---|---|---|---|---|---|
ΔfH°solid | -224.4 ± 1.0 | kJ/mol | Ccb | Biddiscombe, Handley, et al., 1963 | ALS |
Quantity | Value | Units | Method | Reference | Comment |
ΔcH°solid | -4352.82 ± 0.92 | kJ/mol | Ccb | Biddiscombe, Handley, et al., 1963 | Corresponding ΔfHºsolid = -224.4 kJ/mol (simple calculation by NIST; no Washburn corrections); ALS |
Constant pressure heat capacity of solid
Cp,solid (J/mol*K) | Temperature (K) | Reference | Comment |
---|---|---|---|
206.9 | 298.15 | Nichols and Wads, 1975 | DH |

Phase change data

Data compiled as indicated in comments:
BS - Robert L. Brown and Stephen E. Stein
TRC - Thermodynamics Research Center, NIST Boulder Laboratories, Chris Muzny director
AC - William E. Acree, Jr., James S. Chickos
ALS - Hussein Y. Afeefy, Joel F. Liebman, and Stephen E. Stein
DRB - Donald R. Burgess, Jr.
Quantity | Value | Units | Method | Reference | Comment |
---|---|---|---|---|---|
Tboil | 490. ± 5. | K | AVG | N/A | Average of 17 values; Individual data points |
Quantity | Value | Units | Method | Reference | Comment |
Tfus | 319. ± 1. | K | AVG | N/A | Average of 14 values; Individual data points |
Quantity | Value | Units | Method | Reference | Comment |
Tc | 716.45 | K | N/A | Ambrose, 1963 | Uncertainty assigned by TRC = 0.8 K; TRC |
Quantity | Value | Units | Method | Reference | Comment |
ΔsubH° | 80.3 ± 0.1 | kJ/mol | V | Biddiscombe, Handley, et al., 1963 | ALS |
ΔsubH° | 80.1 | kJ/mol | N/A | Biddiscombe, Handley, et al., 1963 | DRB |
Enthalpy of vaporization
ΔvapH (kJ/mol) | Temperature (K) | Method | Reference | Comment |
---|---|---|---|---|
53.2 | 459. | A,GS,EB | Stephenson and Malanowski, 1987 | Based on data from 444. to 503. K. See also Biddiscombe, Handley, et al., 1963, 2.; AC |
56.5 | 348. | N/A | Stage, Müller, et al., 1953 | Based on data from 337. to 503. K.; AC |
54.7 | 373. | N/A | Stage, Müller, et al., 1953 | Based on data from 337. to 503. K.; AC |
53.8 | 398. | N/A | Stage, Müller, et al., 1953 | Based on data from 337. to 503. K.; AC |
51.3 | 423. | N/A | Stage, Müller, et al., 1953 | Based on data from 337. to 503. K.; AC |
47.6 | 473. | N/A | Stage, Müller, et al., 1953 | Based on data from 337. to 503. K.; AC |
Antoine Equation Parameters
log10(P) = A − (B / (T + C))
P = vapor pressure (bar)
T = temperature (K)
View plot Requires a JavaScript / HTML 5 canvas capable browser.
Temperature (K) | A | B | C | Reference | Comment |
---|---|---|---|---|---|
444.90 to 502.29 | 4.14009 | 1550.369 | -116.136 | Biddiscombe, Handley, et al., 1963 | Coefficents calculated by NIST from author's data. |

Reaction thermochemistry data

Data compiled by: John E. Bartmess
Individual Reactions
C8H9O- + =
By formula: C8H9O- + H+ = C8H10O
Quantity | Value | Units | Method | Reference | Comment |
---|---|---|---|---|---|
ΔrH° | 1463. ± 8.8 | kJ/mol | G+TS | Fujio, McIver, et al., 1981 | gas phase; value altered from reference due to change in acidity scale |
Quantity | Value | Units | Method | Reference | Comment |
ΔrG° | 1435. ± 8.4 | kJ/mol | IMRE | Fujio, McIver, et al., 1981 | gas phase; value altered from reference due to change in acidity scale |

Gas phase ion energetics data

Data compiled as indicated in comments:
B - John E. Bartmess
LBLHLM - Sharon G. Lias, John E. Bartmess, Joel F. Liebman, John L. Holmes, Rhoda D. Levin, and W. Gary Mallard
RDSH - Henry M. Rosenstock, Keith Draxl, Bruce W. Steiner, and John T. Herron
Ionization energy determinations
IE (eV) | Method | Reference | Comment |
---|---|---|---|
7.84 | EI | Russell, Freiser, et al., 1983 | LBLHLM |
Appearance energy determinations
Ion | AE (eV) | Other Products | Method | Reference | Comment |
---|---|---|---|---|---|
C6H7+ | 11.27 | ? | EI | Russell, Freiser, et al., 1983 | LBLHLM |
C7H7O+ | 10.39 | CH3 | EI | Russell, Freiser, et al., 1983 | LBLHLM |
C7H7O+ | 10.8 ± 0.1 | CH3 | EI | Tait, Shannon, et al., 1962 | RDSH |
De-protonation reactions
C8H9O- + =
By formula: C8H9O- + H+ = C8H10O
Quantity | Value | Units | Method | Reference | Comment |
---|---|---|---|---|---|
ΔrH° | 1463. ± 8.8 | kJ/mol | G+TS | Fujio, McIver, et al., 1981 | gas phase; value altered from reference due to change in acidity scale; B |
Quantity | Value | Units | Method | Reference | Comment |
ΔrG° | 1435. ± 8.4 | kJ/mol | IMRE | Fujio, McIver, et al., 1981 | gas phase; value altered from reference due to change in acidity scale; B |

Kovats' RI, non-polar column, isothermal

Column type | Active phase | Temperature (C) | I | Reference | Comment |
---|---|---|---|---|---|
Capillary | SE-30 | 100. | 1142. | Berezkin, Popova, et al., 1997 | 30. m/0.25 mm/0.5 μm, He |
Capillary | PS-255 | 150. | 1142. | Engewald, Billing, et al., 1988 | 50. m/0.30 mm/0.25 μm |

Kovats' RI, non-polar column, custom temperature program

Column type | Active phase | I | Reference | Comment |
---|---|---|---|---|
Packed | SE-30 | 1162. | Grzybowski, Lamparczyk, et al., 1980 | Chromosorb W HMDS (80-100 mesh); Column length: 2.9 m; Program: not specified |

Van Den Dool and Kratz RI, non-polar column, temperature ramp

Column type | Active phase | I | Reference | Comment |
---|---|---|---|---|
Capillary | SPB-5 | 1166. | Pino, Marbot, et al., 2004 | 30. m/0.25 mm/0.25 μm, He, 60. C @ 2. min, 4. K/min, 250. C @ 20. min |
Capillary | HP-1 | 1136. | Cavalli, Fernandez, et al., 2003 | 50. m/0.2 mm/0.33 μm, He, 60. C @ 5. min, 2. K/min, 250. C @ 20. min |
Capillary | DB-5MS | 1163. | Chassagne, Boulanger, et al., 1999 | 30. m/0.25 mm/0.25 μm, H2, 2. K/min; Tstart: 40. C; Tend: 200. C |
Capillary | DB-1 | 1145. | Bartelt, 1997 | 30. m/0.32 mm/5. μm, He, 35. C @ 1. min, 10. K/min; Tend: 270. C |
Capillary | DB-5 | 1168. | Rostad and Pereira, 1986 | 30. m/0.26 mm/0.25 μm, He, 50. C @ 4. min, 6. K/min, 300. C @ 20. min |

Van Den Dool and Kratz RI, non-polar column, custom temperature program

Column type | Active phase | I | Reference | Comment |
---|---|---|---|---|
Capillary | VF-5MS | 1165.8 | Mjøs, Meier, et al., 2006 | 50. m/0.25 mm/0.25 μm, He; Program: 60C(2min) => 30C/min => 100C => 1C/min => |
Capillary | VF-5MS | 1167.2 | Mjøs, Meier, et al., 2006 | 50. m/0.25 mm/0.25 μm, He; Program: 60C(2min) => 30C/min => 100C => 2C/min => |
Capillary | VF-5MS | 1168.5 | Mjøs, Meier, et al., 2006 | 50. m/0.25 mm/0.25 μm, He; Program: 60C(2min) => 30C/min => 100C => 4C/min => |
Capillary | DB-5MS | 1161. | Boulanger and Crouzet, 2001 | 30. m/0.25 mm/0.25 μm, H2; Program: 40C (5min) => 2C/min => 200C => 5C/min => 250C (15min) |
Capillary | DB-5MS | 1153. | Boulanger and Crouzet, 2000 | 30. m/0.25 mm/0.25 μm, H2/N2; Program: 40C (5min) => 2C/min => 200C => 5C/min => 250C (15min) |

Van Den Dool and Kratz RI, polar column, temperature ramp

Column type | Active phase | I | Reference | Comment |
---|---|---|---|---|
Capillary | DB-Wax | 2183. | Botelho, Caldeira, et al., 2007 | 30. m/0.25 mm/0.25 μm, He, 50. C @ 2. min, 3.5 K/min, 180. C @ 25. min |
Capillary | Innowax | 2195. | Botelho, Caldeira, et al., 2007 | 30. m/0.25 mm/0.25 μm, H2, 45. C @ 5. min, 3.5 K/min, 210. C @ 20. min |
Capillary | DB-Wax | 2210. | Gurbuz O., Rouseff J.M., et al., 2006 | 60. m/0.25 mm/0.25 μm, He, 7. K/min, 265. C @ 5. min; Tstart: 40. C |
Capillary | Innowax | 2195. | Lee, Lee, et al., 2006 | 60. m/0.25 mm/0.25 μm, He, 40. C @ 4. min, 4. K/min, 230. C @ 20. min |
Capillary | DB-Wax | 2174. | Lopez-Galilea I., Fournier N., et al., 2006 | 30. m/0.32 mm/0.5 μm, He, 5. K/min, 240. C @ 10. min; Tstart: 40. C |
Capillary | ZB-Wax | 2190. | Ledauphin, Saint-Clair, et al., 2004 | 30. m/0.25 mm/0.15 μm, He, 35. C @ 10. min, 1.8 K/min, 220. C @ 10. min |
Capillary | Supelcowax-10 | 2182. | Chung, Yung, et al., 2001 | 60. m/0.25 mm/0.25 μm, He, 35. C @ 5. min, 2. K/min, 195. C @ 90. min |
Capillary | DB-FFAP | 2185. | Charles, Martin, et al., 2000 | 30. m/0.32 mm/0.25 μm, H2, 40. C @ 2. min, 5. K/min; Tend: 240. C |
Capillary | Supelcowax-10 | 2183. | Chung, 2000 | 60. m/0.25 mm/0.25 μm, He, 2. K/min, 195. C @ 90. min; Tstart: 35. C |
Capillary | DB-Wax | 2164. | Chassagne, Boulanger, et al., 1999 | 30. m/0.25 mm/0.25 μm, H2, 60. C @ 3. min, 2. K/min; Tend: 220. C |
Capillary | Supelcowax-10 | 2183. | Chung, 1999 | 60. m/0.25 mm/0.25 μm, He, 35. C @ 5. min, 2. K/min, 195. C @ 90. min |
Capillary | DB-Wax | 2167. | Umano, Hagi, et al., 1992 | He, 40. C @ 10. min, 2. K/min; Column length: 30. m; Column diameter: 0.25 mm; Tend: 200. C |

Van Den Dool and Kratz RI, polar column, custom temperature program

Column type | Active phase | I | Reference | Comment |
---|---|---|---|---|
Capillary | DB-Wax | 2195. | Selli, Cabaroglu, et al., 2004 | 30. m/0.32 mm/0.5 μm, H2; Program: 60C(3min) => 2C/min => 220C => 3C/min => 245C (20min) |
Capillary | DB-Wax | 2153. | Cantergiani, Brevard, et al., 2001 | 30. m/0.25 mm/0.25 μm; Program: 20C(30s) => fast => 60C => 4C/min => 220C (20min) |
Capillary | FFAP | 2198. | Yasuhara, 1987 | 50. m/0.25 mm/0.25 μm, He; Program: 20C (5min) => 2C/min => 70C => 4C/min => 210C |

Normal alkane RI, non-polar column, temperature ramp

Column type | Active phase | I | Reference | Comment |
---|---|---|---|---|
Capillary | HP-5 MS | 1168. | Fanaro, Duarte, et al., 2012 | 30. m/0.25 mm/0.25 μm, Helium, 50. C @ 0.5 min, 5. K/min, 250. C @ 0.5 min |
Capillary | DB-5 | 1193. | Czerny, Brueckner, et al., 2011 | 30. m/0.32 mm/0.25 μm, Helium, 40. C @ 2. min, 8. K/min, 250. C @ 5. min |
Capillary | ZB-5 | 1171. | Harrison and Priest, 2009 | 30. m/0.25 mm/0.25 μm, Helium, 40. C @ 1. min, 6. K/min, 280. C @ 9. min |
Capillary | HP-5 MS | 1161. | Bozi, Czagany, et al., 2007 | 30. m/0.25 mm/0.25 μm, Helium, 50. C @ 1. min, 10. K/min, 300. C @ 4. min |
Capillary | DB-5 | 1170. | Xu, Fan, et al., 2007 | 30. m/0.32 mm/0.25 μm, He, 40. C @ 2. min, 4. K/min, 250. C @ 5. min |
Capillary | HP-1 | 1136. | Castel, Fernandez, et al., 2006 | 50. m/0.2 mm/0.33 μm, He, 60. C @ 4. min, 2. K/min, 250. C @ 30. min |
Capillary | HP-1 | 1130. | Castel, Fernandez, et al., 2006 | 50. m/0.2 mm/0.33 μm, He, 60. C @ 4. min, 2. K/min, 250. C @ 30. min |
Capillary | HP-1 | 1141. | Castel, Fernandez, et al., 2006, 2 | 50. m/0.2 mm/0.5 μm, He, 2. K/min, 250. C @ 120. min; Tstart: 60. C |
Capillary | DB-5 | 1181. | Fan and Qian, 2006 | 30. m/0.32 mm/1. μm, N2, 40. C @ 2. min, 6. K/min, 230. C @ 15. min |
Capillary | HP-5 | 1192. | Jiménez, Aguilera, et al., 2006 | 30. m/0.25 mm/0.25 μm, 40. C @ 5. min, 4. K/min, 220. C @ 10. min |
Capillary | DB-5 | 1178. | El-Sayed, Heppelthwaite, et al., 2005 | 30. m/0.25 mm/0.25 μm, 40. C @ 2. min, 4. K/min; Tend: 240. C |
Capillary | HP-1 | 1137. | Fernandez, Lizzani-Cuvelier, et al., 2005 | 50. m/0.2 mm/0.25 μm, 60. C @ 60. min, 2. K/min; Tend: 250. C |
Capillary | DB-5 | 1171. | Jelén, Krawczyk, et al., 2005 | 30. m/0.25 mm/0.25 μm, He, 8. K/min; Tstart: 40. C; Tend: 280. C |
Capillary | DB-1 | 1133. | Lee, Lee, et al., 2005 | 60. m/0.32 mm/0.25 μm, He, 35. C @ 4. min, 2. K/min, 230. C @ 25. min |
Capillary | DB-1 | 1141. | Lee, Lee, et al., 2005 | 60. m/0.32 mm/0.25 μm, He, 35. C @ 4. min, 2. K/min, 230. C @ 25. min |
Capillary | SPB-5 | 1169. | Ledauphin, Guichard, et al., 2003 | 30. m/0.32 mm/0.25 μm, He, 40. C @ 1. min, 5. K/min, 220. C @ 20. min |
Capillary | AT-1 | 1170. | Kelling, 2001 | He, 50. C @ 2. min, 10. K/min; Tend: 300. C |
Capillary | BP-5 | 1188. | Lopez, Ferreira, et al., 1999 | 50. m/0.32 mm/1. μm, He, 40. C @ 5. min, 2. K/min; Tend: 190. C |
Capillary | Ultra-1 | 1137. | Okumura, 1991 | 25. m/0.32 mm/0.25 μm, He, 3. K/min; Tstart: 80. C; Tend: 260. C |
Capillary | DB-1 | 1142. | Habu, Flath, et al., 1985 | 3. K/min; Column length: 50. m; Column diameter: 0.32 mm; Tstart: 0. C; Tend: 250. C |
Capillary | DB-1 | 1141. | Habu, Flath, et al., 1985 | 3. K/min; Column length: 50. m; Column diameter: 0.32 mm; Tstart: 50. C; Tend: 250. C |

Normal alkane RI, non-polar column, custom temperature program

Column type | Active phase | I | Reference | Comment |
---|---|---|---|---|
Capillary | SLB-5 MS | 1169. | Mondello, 2012 | 30. m/0.25 mm/0.25 μm, Helium; Program: not specified |
Capillary | SLB-5 MS | 1171. | Mondello, 2012 | 30. m/0.25 mm/0.25 μm, Helium; Program: not specified |
Capillary | Polydimethyl siloxane with 5 % Ph groups | 1178. | Robinson, Adams, et al., 2012 | Program: not specified |
Capillary | Polydimethyl siloxane with 5 % Ph groups | 1184. | Robinson, Adams, et al., 2012 | Program: not specified |
Capillary | DB-5 | 1168. | San-Juan, Petka, et al., 2010 | 30. m/0.32 mm/0.50 μm, Hydrogen; Program: 40 0C (5 min) 4 0C/min -> 100 0C 6 0C/min -> 220 0C (20 min) |
Capillary | HP-5 | 1169. | Zhao, Li, et al., 2008 | 30. m/0.25 mm/0.25 μm; Program: 40 0C (2 min) 5 0C/min -> 80 0C 7 oC/min -> 160 0C 9 0C/min -> 200 0C 20 0C/min -> 280 0C (10 min) |
Capillary | HP-5 | 1178. | Zhao, Li, et al., 2008 | 30. m/0.25 mm/0.25 μm; Program: not specified |
Capillary | CP-Sil5 CB MS | 1136. | Iraqi, Vermeulen, et al., 2005 | 50. m/0.32 mm/1.2 μm; Program: 36C(2min) => 20C/min => 85C => 1C/min => 145C => 3C/min => 250C(30min) |
Capillary | Polydimethyl siloxane with 5 % Ph groups | 1166. | Pino, Marbot, et al., 2005 | Program: not specified |
Capillary | MFE-73 | 1168. | Escudero, Gogorza, et al., 2004 | Program: not specified |
Capillary | SPB-5 | 1165. | Begnaud, Pérès, et al., 2003 | 60. m/0.32 mm/1. μm; Program: not specified |
Capillary | HP-5MS | 1178. | Martí, Mestres, et al., 2003 | 30. m/0.25 mm/0.25 μm, He; Program: 40C(5min) => 2C/min => 120C => 10C/min => 210C (30min) |
Capillary | MFE-73 | 1168. | Ferreira, Ortín, et al., 2002 | H2; Program: not specified |
Capillary | MFE-73 | 1168. | Aznar, López, et al., 2001 | 30. m/0.32 mm/0.1 μm, H2; Program: 40C(5min) => 2C/min => 120C => 10C/min => 210C(30min) |
Capillary | MFE-73 | 1168. | Ferreira, Aznar, et al., 2001 | 30. m/0.32 mm/0.1 μm, H2; Program: 40 C (5min) => 2C/min => 120C => 10 C/min => 210 C (30min) |
Capillary | OV-101 | 1145. | Licker, Acree, et al., 1998 | Program: not specified |
Capillary | SE-30 | 1162. | Peterson, 1992 | Program: not specified |
Capillary | OV-1, SE-30, Methyl silicone, SP-2100, OV-101, DB-1, etc. | 1162. | Waggott and Davies, 1984 | Hydrogen; Column length: 50. m; Column diameter: 0.32 mm; Program: not specified |

Normal alkane RI, polar column, temperature ramp

Column type | Active phase | I | Reference | Comment |
---|---|---|---|---|
Capillary | HP-FFAP | 2207. | Wanakhachornkrai and Lertsiri, 9999 | 25. m/0.32 mm/0.50 μm, Helium, 15. K/min; Tstart: 45. C; Tend: 220. C |
Capillary | HP-FFAP | 2209. | Wanakhachornkrai and Lertsiri, 9999 | 25. m/0.32 mm/0.50 μm, Helium, 15. K/min; Tstart: 45. C; Tend: 220. C |
Capillary | DB-FFAP | 2161. | Czerny, Brueckner, et al., 2011 | 30. m/0.32 mm/0.25 μm, Helium, 40. C @ 2. min, 8. K/min, 230. C @ 5. min |
Capillary | DB-Wax | 2202. | Moon and Shibamoto, 2010 | 60. m/0.25 mm/0.50 μm, Helium, 40. C @ 5. min, 2. K/min, 210. C @ 70. min |
Capillary | DB-Wax | 2167. | Zhao, Xu, et al., 2009 | 30. m/0.25 mm/0.25 μm, Helium, 40. C @ 2. min, 3. K/min, 230. C @ 5. min |
Capillary | DB-Wax | 2201. | Caldeira, de Sousa, et al., 2008 | 30. m/0.25 mm/0.25 μm, Helium, 40. C @ 10. min, 3.5 K/min, 180. C @ 30. min |
Capillary | Supelcowax-10 | 2165. | Vichi, Romero, et al., 2008 | 30. m/0.25 mm/0.25 μm, Helium, 50. C @ 10. min, 8. K/min; Tend: 240. C |
Capillary | DB-Wax | 2181. | Xu, Fan, et al., 2007 | 30. m/0.25 mm/0.25 μm, He, 40. C @ 2. min, 4. K/min, 230. C @ 5. min |
Capillary | DB-Wax | 2185. | Fan and Qian, 2006, 2 | 30. m/0.32 mm/0.25 μm, He, 40. C @ 2. min, 4. K/min, 230. C @ 15. min |
Capillary | DB-Wax | 2188. | Fan and Qian, 2006 | 30. m/0.32 mm/0.25 μm, N2, 40. C @ 2. min, 6. K/min, 230. C @ 15. min |
Capillary | DB-Wax Etr | 2143. | Perestrelo, Fernandes, et al., 2006 | 30. m/0.25 mm/0.25 μm, He, 40. C @ 1. min, 2. K/min, 220. C @ 10. min |
Capillary | DB-Wax | 2186. | Fan and Qian, 2005 | 30. m/0.32 mm/0.25 μm, N2, 40. C @ 2. min, 4. K/min, 230. C @ 5. min |
Capillary | DB-Wax | 2205. | Culleré, Escudero, et al., 2004 | 30. m/0.32 mm/0.5 μm, H2, 40. C @ 5. min, 4. K/min; Tend: 200. C |
Capillary | DB-Wax | 2209. | López, Ezpeleta, et al., 2004 | 60. m/0.25 mm/0.25 μm, He, 40. C @ 5. min, 3. K/min; Tend: 220. C |
Capillary | DB-Wax | 2195. | Lee and Noble, 2003 | 30. m/0.25 mm/0.25 μm, He, 40. C @ 4. min, 4. K/min, 185. C @ 20. min |
Capillary | DB-Wax | 2214. | López, Ortín, et al., 2003 | 30. m/0.32 mm/0.5 μm, H2, 40. C @ 5. min, 4. K/min; Tend: 200. C |
Capillary | HP-FFAP | 2209. | Wanakhachornkrai and Lertsiri, 2003 | 25. m/0.32 mm/0.5 μm, He, 15. K/min; Tstart: 45. C; Tend: 220. C |
Capillary | HP-FFAP | 2207. | Wanakhachornkrai and Lertsiri, 2003 | 25. m/0.32 mm/0.5 μm, He, 15. K/min; Tstart: 45. C; Tend: 220. C |
Capillary | DB-Wax | 2208. | Ferreira, Ortín, et al., 2002 | 30. m/0.32 mm/0.5 μm, H2, 40. C @ 5. min, 4. K/min; Tend: 200. C |
Capillary | DB-Wax | 2195. | Aznar, López, et al., 2001 | 30. m/0.32 mm/0.5 μm, H2, 40. C @ 5. min, 4. K/min, 200. C @ 60. min |
Capillary | EC-1000 | 2180. | Bendall, 2001 | 30. m/0.25 mm/0.25 μm, He, 35. C @ 5. min, 5. K/min, 230. C @ 15. min |
Capillary | DB-Wax | 2195. | Ferreira, Aznar, et al., 2001 | 30. m/0.32 mm/0.5 μm, H2, 40. C @ 5. min, 4. K/min, 200. C @ 60. min |
Capillary | Carbowax 20M | 2142. | Lopez, Ferreira, et al., 1999 | 60. m/0.32 mm/0.5 μm, He, 40. C @ 5. min, 2. K/min; Tend: 190. C |
Capillary | TC-Wax | 2193. | Shuichi, Masazumi, et al., 1996 | 80. C @ 5. min, 3. K/min; Column length: 60. m; Column diameter: 0.25 mm; Tend: 240. C |
Capillary | DB-Wax | 2188. | Andersen J.F., Mikolajczak K.L., et al., 1987 | Helium, 40. C @ 1. min, 6. K/min; Column length: 30. m; Column diameter: 0.32 mm; Tend: 200. C |
Capillary | Carbowax 20M | 2160. | Seifert and King, 1982 | He, 50. C @ 10. min, 1. K/min, 170. C @ 60. min; Column length: 150. m; Column diameter: 0.64 mm |

Normal alkane RI, polar column, custom temperature program

Column type | Active phase | I | Reference | Comment |
---|---|---|---|---|
Capillary | DB-Wax | 2185. | Welke, Manfroi, et al., 2012 | 30. m/0.25 mm/0.25 μm, Helium; Program: not specified |
Capillary | DB-Wax | 2204. | Welke, Manfroi, et al., 2012 | 30. m/0.25 mm/0.25 μm, Helium; Program: not specified |
Capillary | DB-Wax | 2185. | San-Juan, Petka, et al., 2010 | 30. m/0.32 mm/0.50 μm, Hydrogen; Program: 40 0C (5 min) 4 0C/min -> 100 0C 6 0C/min -> 220 0C (20 min) |
Capillary | Stabilwax | 2198. | Chinnici, Guerrero, et al., 2009 | 30. m/0.25 mm/0.25 μm, Helium; Program: 35 0C 3 0C/min -> 100 0C 5 0C/min -> 240 0C (10 min) |
Capillary | DB-Wax | 2190. | Zhao, Xu, et al., 2009 | 30. m/0.25 mm/0.25 μm, Helium; Program: not specified |
Capillary | SOLGel-Wax | 2152. | Shu and Shen, 2008 | 30. m/0.53 mm/0.50 μm, Helium; Program: 40 0C 7 0C/min -> 180 0C 10 0C/min -> 240 0C (10 min) |
Capillary | SOLGel-Wax | 2153. | Shu and Shen, 2008 | 30. m/0.53 mm/0.50 μm, Helium; Program: not specified |
Capillary | DB-Wax | 2157. | Tao, Wenlai, et al., 2008 | 30. m/0.32 mm/0.25 μm, Helium; Program: 50 0C 20 0C/min -> 80 0C 3 0C/min -> 230 0C |
Capillary | DB-Wax | 2175. | Tian, Zhang, et al., 2007 | 30. m/0.25 mm/0.25 μm, He; Program: 50 0C (2 min) 6 0C/min -> 150 0C 8 0C/min -> 230 0C (15 min) |
Capillary | DB-Wax | 2172. | Lee, Lee, et al., 2005 | 60. m/0.32 mm/0.25 μm, He; Program: 30C(4min) => 2C/min => 170C(25min) => 10C/min => 210C(10min) |
Capillary | DB-Wax | 2172. | Lee, Lee, et al., 2005 | 60. m/0.32 mm/0.25 μm, He; Program: 30C(4min) => 2C/min => 170C(25min) => 10C/min => 210C(10min) |
Capillary | DB-Wax | 2208. | Escudero, Gogorza, et al., 2004 | Program: not specified |
Capillary | Carbowax 20M | 2150. | Vinogradov, 2004 | Program: not specified |
Capillary | HP-Innowax FSC | 2196. | Erdemoglu, Sener, et al., 2003 | 60. m/0.25 mm/0.25 μm, He; Program: 60C(10min) => 4C/min => 220C(10min) => 1C/min => 240C |
Capillary | CP-WAX 57CB | 2206. | Martí, Mestres, et al., 2003 | 50. m/0.25 mm/0.2 μm, He; Program: 40C(10min) => 5C/min => 100C => 3C/min => 180C => 20C/min => 210C (10min) |
Capillary | TRWAX | 2214. | Torrens, 2002 | 60. m/0.25 mm/0.25 μm, He; Program: not specified |
Capillary | Nukol | 2181. | López and Dufour, 2001 | N2; Column length: 25. m; Column diameter: 0.25 mm; Program: 45C(5min) => 20C/min => 100C(1min) => 3C/min => 190C(40min) |
Capillary | Carbowax 20M | 2212. | Zimmermann, Lauterbach, et al., 1985 | Program: not specified |

Lee's RI, non-polar column, temperature ramp

Column type | Active phase | I | Reference | Comment |
---|---|---|---|---|
Capillary | HP-5 | 191.2 | Shao, Wang, et al., 2006 | 30. m/0.3 mm/0.25 μm, He, 50. C @ 5. min, 5. K/min, 200. C @ 15. min |
Capillary | DB-5 | 195.91 | Williams and Horne, 1995 | He, 60. C @ 2. min, 5. K/min; Column length: 25. m; Column diameter: 0.3 mm; Tend: 270. C |
Capillary | DB-5 | 194.5 | Donnelly, Abdel-Hamid, et al., 1993 | 30. m/0.32 mm/0.25 μm, He, 40. C @ 3. min, 8. K/min, 285. C @ 29.5 min |
Capillary | DB-5 | 196.28 | Rostad and Pereira, 1986 | 30. m/0.26 mm/0.25 μm, He, 50. C @ 4. min, 6. K/min, 300. C @ 20. min |

References

Biddiscombe, Handley, et al., 1963
Biddiscombe, D.P.; Handley, R.; Harrop, D.; Head, A.J.; Lewis, G.B.; Martin, J.F.; Sprake, C.H.S.,
Thermodynamic properties of organic oxygen compounds. Part XIII. Preparation and physical properties of pure ethylphenols,
J. Chem. Soc., 1963, 5764-5768. [all data]
Nichols and Wads, 1975
Nichols, N.; Wads, I.,
Thermochemistry of solutions of biochemical model compounds. 3. Some benzene derivatives in aqueous solution,
J. Chem. Thermodynam., 1975, 7, 329-336. [all data]
Ambrose, 1963
Ambrose, D.,
Critical Temperatures of Some Phenols and Other Organic Compounds,
Trans. Faraday Soc., 1963, 59, 1988. [all data]
Stephenson and Malanowski, 1987
Stephenson, Richard M.; Malanowski, Stanislaw,
Handbook of the Thermodynamics of Organic Compounds, 1987, https://doi.org/10.1007/978-94-009-3173-2
. [all data]
Biddiscombe, Handley, et al., 1963, 2
Biddiscombe, D.P.; Handley, R.; Harrop, D.; Head, A.J.; Lewis, G.B.; Martin, J.F.; Sprake, C.H.S.,
1099. Thermodynamic properties of organic oxygen compounds. Part XIII. Preparation and physical properties of pure ethylphenols,
J. Chem. Soc., 1963, 5764, https://doi.org/10.1039/jr9630005764
. [all data]
Stage, Müller, et al., 1953
Stage, H.; Müller, E.; Faldix, P.,
Erdol u Kohle, 1953, 6, 375. [all data]
Fujio, McIver, et al., 1981
Fujio, M.; McIver, R.T., Jr.; Taft, R.W.,
Effects on the acidities of phenols from specific substituent-solvent interactions. Inherent substituent parameters from gas phase acidities,
J. Am. Chem. Soc., 1981, 103, 4017. [all data]
Russell, Freiser, et al., 1983
Russell, D.H.; Freiser, B.S.; McBay, E.H.; Canada, D.C.,
The structure of decomposing [C7H7O]+ ions: Benzyl versus tropylium ion structures,
Org. Mass Spectrom., 1983, 18, 474. [all data]
Tait, Shannon, et al., 1962
Tait, J.M.S.; Shannon, T.W.; Harrison, A.G.,
The structure of substituted C7 ions from benzyl derivatives at the appearance potential threshold,
J. Am. Chem. Soc., 1962, 84, 4. [all data]
Berezkin, Popova, et al., 1997
Berezkin, V.G.; Popova, T.P.; Shiryayeva, V.Ye.; Nomura, N.,
Gas-chromatographic separation of monoalkylphenols on polar and non-polar phases by means of capillary chromatography,
Pet. Chem. USSR (Engl. Transl.), 1997, 37, 2, 161-167. [all data]
Engewald, Billing, et al., 1988
Engewald, W.; Billing, U.; Topalova, I.; Petsev, N.,
Structure-retention correlations of alkylphenols in gas-liquid and gas-solid chromatography,
J. Chromatogr., 1988, 446, 71-77, https://doi.org/10.1016/S0021-9673(00)94419-4
. [all data]
Grzybowski, Lamparczyk, et al., 1980
Grzybowski, J.; Lamparczyk, H.; Nasal, A.; Radecki, A.,
Relationship between the retention indices of phenols on polar and non-polar stationary phases,
J. Chromatogr., 1980, 196, 2, 217-223, https://doi.org/10.1016/S0021-9673(00)80441-0
. [all data]
Pino, Marbot, et al., 2004
Pino, J.A.; Marbot, R.; Rosado, A.; Vázquez, C.,
Volatile constituents of Malay rose apple [Syzygium malaccense (L.) Merr. Perry],
Flavour Fragr. J., 2004, 19, 1, 32-35, https://doi.org/10.1002/ffj.1269
. [all data]
Cavalli, Fernandez, et al., 2003
Cavalli, J.-F.; Fernandez, X.; Lizzani-Cuvelier, L.; Loiseau, A.-M.,
Comparison of static headspace, headspace solid phase microextraction, headspace sorptive extraction, and direct thermal desorption techniques on chemical composition of French olive oils,
J. Agric. Food Chem., 2003, 51, 26, 7709-7716, https://doi.org/10.1021/jf034834n
. [all data]
Chassagne, Boulanger, et al., 1999
Chassagne, D.; Boulanger, R.; Crouzet, J.,
Enzymatic hydrolysis of edible Passiflora fruit glycosides,
Food Chem., 1999, 66, 3, 281-288, https://doi.org/10.1016/S0308-8146(99)00044-8
. [all data]
Bartelt, 1997
Bartelt, R.J.,
Calibration of a commercial solid-phase microextraction device for measuring headspace concentrations of organic volatiles,
Anal. Chem., 1997, 69, 3, 364-372, https://doi.org/10.1021/ac960820n
. [all data]
Rostad and Pereira, 1986
Rostad, C.E.; Pereira, W.E.,
Kovats and Lee retention indices determined by gas chromatography/mass spectrometry for organic compounds of environmental interest,
J. Hi. Res. Chromatogr. Chromatogr. Comm., 1986, 9, 6, 328-334, https://doi.org/10.1002/jhrc.1240090603
. [all data]
Mjøs, Meier, et al., 2006
Mjøs, S.A.; Meier, S.; Boitsov, S.,
Alkylphenol retention indices,
J. Chromatogr. A, 2006, 1123, 1, 98-105, https://doi.org/10.1016/j.chroma.2006.05.002
. [all data]
Boulanger and Crouzet, 2001
Boulanger, R.; Crouzet, J.,
Identification of the aroma components of acerola (Malphigia glabra L.): free and bound flavor compounds,
Food Chem., 2001, 74, 2, 209-216, https://doi.org/10.1016/S0308-8146(01)00128-5
. [all data]
Boulanger and Crouzet, 2000
Boulanger, R.; Crouzet, J.,
Free and bound flavour components of Amazonian fruits: 3-glycosidically bound components of cupuacu,
Food Chem., 2000, 70, 4, 463-470, https://doi.org/10.1016/S0308-8146(00)00112-6
. [all data]
Botelho, Caldeira, et al., 2007
Botelho, G.; Caldeira, I.; Mendes-Faia, A.; Clímaco, M.C.,
Evaluation of two quantitative gas chromatography-olfactometry methods for clonal red wines differentiation,
Flavour Fragr. J., 2007, 22, 5, 414-420, https://doi.org/10.1002/ffj.1815
. [all data]
Gurbuz O., Rouseff J.M., et al., 2006
Gurbuz O.; Rouseff J.M.; Rouseff R.L.,
Comparison of aroma volatiles in commercial Merlot and Cabernet Sauvignon wines using gas chromatography - Olfactometry and gas chromatography - Mass spectrometry,
J. Agric. Food Chem., 2006, 54, 11, 3990-3996, https://doi.org/10.1021/jf053278p
. [all data]
Lee, Lee, et al., 2006
Lee, S.-J.; Lee, J.-E.; Kim, H.-W.; Kim, S.-S.; Koh, K.-H.,
Development of Korean red wines using Vitis labrusca varieties: instrumental and sensory characterization,
Food Chem., 2006, 94, 3, 385-393, https://doi.org/10.1016/j.foodchem.2004.11.035
. [all data]
Lopez-Galilea I., Fournier N., et al., 2006
Lopez-Galilea I.; Fournier N.; Cid C.; Guichard E.,
Changes in headspace volatile concentrations of coffee brews caused by the roasting process and the brewing procedure,
J. Agric. Food Chem., 2006, 54, 22, 8560-8566, https://doi.org/10.1021/jf061178t
. [all data]
Ledauphin, Saint-Clair, et al., 2004
Ledauphin, J.; Saint-Clair, J.-F.; Lablanquie, O.; Guichard, H.; Founier, N.; Guichard, E.; Barillier, D.,
Identification of trace volatile compounds in freshly distilled calvados and cognac using preparative separations coupled with gas chromatography-mass spectrometry,
J. Agric. Food Chem., 2004, 52, 16, 5124-5134, https://doi.org/10.1021/jf040052y
. [all data]
Chung, Yung, et al., 2001
Chung, H.Y.; Yung, I.K.S.; Kim, J.-S.,
Comparison of volatile components in dried scallops (Chlamys farreri and Patinopecten yessoensis) prepared by boiling and steaming methods,
J. Agric. Food Chem., 2001, 49, 1, 192-202, https://doi.org/10.1021/jf000692a
. [all data]
Charles, Martin, et al., 2000
Charles, M.; Martin, B.; Ginies, C.; Etievant, P.; Coste, G.; Guichard, E.,
Potent aroma compounds of two red wine vinegars,
J. Agric. Food Chem., 2000, 48, 1, 70-77, https://doi.org/10.1021/jf9905424
. [all data]
Chung, 2000
Chung, H.Y.,
Volatile flavor components in red fermented soybean (Glycine max) curds,
J. Agric. Food Chem., 2000, 48, 5, 1803-1809, https://doi.org/10.1021/jf991272s
. [all data]
Chung, 1999
Chung, H.Y.,
Volatile components in fermented soybean (Glycine max) curds,
J. Agric. Food Chem., 1999, 47, 7, 2690-2696, https://doi.org/10.1021/jf981166a
. [all data]
Umano, Hagi, et al., 1992
Umano, K.; Hagi, Y.; Nakahara, K.; Shoji, A.; Shibamoto, T.,
Volatile constituents of green and ripened pineapple (Aanas comosus [L.] Merr.),
J. Agric. Food Chem., 1992, 40, 4, 599-603, https://doi.org/10.1021/jf00016a014
. [all data]
Selli, Cabaroglu, et al., 2004
Selli, S.; Cabaroglu, T.; Canbas, A.; Erten, H.; Nurgel, C.; Lepoutre, J.P.; Gunata, Z.,
Volatile composition of red wine from cv. Kalecik Karasi grown in central Anatolia,
Food Chem., 2004, 85, 2, 207-213, https://doi.org/10.1016/j.foodchem.2003.06.008
. [all data]
Cantergiani, Brevard, et al., 2001
Cantergiani, E.; Brevard, H.; Krebs, Y.; Feria-Morales, A.; Amadò, R.; Yeretzian, C.,
Characterisation of the aroma of green Mexican coffee and identification of mouldy/earthy defect,
Eur. Food Res. Technol., 2001, 212, 6, 648-657, https://doi.org/10.1007/s002170100305
. [all data]
Yasuhara, 1987
Yasuhara, A.,
Identification of Volatile Compounds in Poultry Manure by Gas Chromatography-Mass Spectrometry,
J. Chromatogr., 1987, 387, 371-378, https://doi.org/10.1016/S0021-9673(01)94539-X
. [all data]
Fanaro, Duarte, et al., 2012
Fanaro, G.B.; Duarte, R.C.; Santillo, A.G.; Pinto e Silva, M.E.M.; Purgatto, E.; Villavicento, A.L.C.H.,
Evaluation of γ-radiation on oolong tea odor volatiles,
Radiation Phys. Chem., 2012, 81, 8, 1152-1156, https://doi.org/10.1016/j.radphyschem.2011.11.061
. [all data]
Czerny, Brueckner, et al., 2011
Czerny, M.; Brueckner, R.; Kirchoff, E.; Schmitt, R.; Buettner, A.,
The influence of molecular structure on odor qualities and odor detection thresholds of volatile alkylated phenols,
Chem. Senses, 2011, 1-15, retrieved from http://chemie.oxfordjournals.org. [all data]
Harrison and Priest, 2009
Harrison, B.M.; Priest, F.G.,
Composition of peaks used in the preparation of malt for Scotch Whisky production - influence of geographical source and extraction depth,
J. Agric. Food Chem., 2009, 57, 6, 2385-2391, https://doi.org/10.1021/jf803556y
. [all data]
Bozi, Czagany, et al., 2007
Bozi, J.; Czagany, Z.; Meszaros, E.; Blazso, M.,
Thermal decomposition of flame retarded polycarbonates,
J. Anal. Appl. Pyrolysis, 2007, 79, 1-2, 337-345, https://doi.org/10.1016/j.jaap.2007.01.001
. [all data]
Xu, Fan, et al., 2007
Xu, Y.; Fan, W.; Qian, M.C.,
Characterization of Aroma Compounds in Apple Cider Using Solvent-Assisted Flavor Evaporation and Headspace Solid-Phase Microextraction,
J. Agric. Food Chem., 2007, 55, 8, 3051-3057, https://doi.org/10.1021/jf0631732
. [all data]
Castel, Fernandez, et al., 2006
Castel, C.; Fernandez, X.; Lizzani-Cuvelier, L.; Loiseau, A.-M.; Perichet, C.; Delbecque, C.; Arnaudo, J.-F.,
Volatile constituents of benzoin gums: Siam and Sumatra, part 2. Study of headspace sampling methods,
Flavour Fragr. J., 2006, 21, 1, 59-67, https://doi.org/10.1002/ffj.1502
. [all data]
Castel, Fernandez, et al., 2006, 2
Castel, C.; Fernandez, X.; Lizzani-Cuvelier, L.; Perichet, C.; Lavoine, S.,
Characterization of the Chemical Composition of a Byproduct from Siam Benzoin Gum,
J. Agric. Food Chem., 2006, 54, 23, 8848-8854, https://doi.org/10.1021/jf061193y
. [all data]
Fan and Qian, 2006
Fan, W.; Qian, M.C.,
Identification of aroma compounds in Chinese 'Yanghe Daqu' liquor by normal phase chromatography fractionation followed by gas chromatography/olfactometry,
Flavour Fragr. J., 2006, 21, 2, 333-342, https://doi.org/10.1002/ffj.1621
. [all data]
Jiménez, Aguilera, et al., 2006
Jiménez, A.; Aguilera, M.P.; Beltrán, G.; Uceda, M.,
Application of solid-phase microextraction to virgin olive oil quality control,
J. Chromatogr. A, 2006, 1121, 1, 140-144, https://doi.org/10.1016/j.chroma.2006.05.005
. [all data]
El-Sayed, Heppelthwaite, et al., 2005
El-Sayed, A.M.; Heppelthwaite, V.J.; Manning, L.M.; Gibb, A.R.; Suckling, D.M.,
Volatile constituents of fermented sugar baits and their attraction to lepidopteran species,
J. Agric. Food Chem., 2005, 53, 4, 953-958, https://doi.org/10.1021/jf048521j
. [all data]
Fernandez, Lizzani-Cuvelier, et al., 2005
Fernandez, X.; Lizzani-Cuvelier, L.; Loiseau, A.-M.; Perichet, C.; Delbecque, C.; Arnaudo, J.-F.,
Chemical composition of the essential oils from Turkish and Honduras Styrax,
Flavour Fragr. J., 2005, 20, 1, 70-73, https://doi.org/10.1002/ffj.1370
. [all data]
Jelén, Krawczyk, et al., 2005
Jelén, H.H.; Krawczyk, J.; Larsen, T.O.; Jarosz, A.; Golebniak, B.,
Main compounds responsible for off-odour of strawberries infected by Phytophthora cactorum,
Lett. Appl. Microbiol., 2005, 40, 4, 255-259, https://doi.org/10.1111/j.1472-765X.2005.01668.x
. [all data]
Lee, Lee, et al., 2005
Lee, K.-G.; Lee, S.-E.; Takeoka, G.R.; Kim, J.-H.; Park, B.-S.,
Antioxidant activity and characterization of volatile constituents of beechwood creosote,
J. Sci. Food Agric., 2005, 85, 9, 1580-1586, https://doi.org/10.1002/jsfa.2156
. [all data]
Ledauphin, Guichard, et al., 2003
Ledauphin, J.; Guichard, H.; Saint-Clair, J.-F.; Picoche, B.; Barillier, D.,
Chemical and sensorial aroma characterization of freshly distilled calvados. 2. Identification of volatile compounds and key odorants,
J. Agric. Food Chem., 2003, 51, 2, 433-442, https://doi.org/10.1021/jf020373e
. [all data]
Kelling, 2001
Kelling, F.J.,
Olfaction in houseflies: morphology and electrophysiology. Chapter 7. Chemical and electrophysiological analysis of components, present in natural products that attract houseflies, Dissertation, University of Groningen, The Netherlands, 2001. [all data]
Lopez, Ferreira, et al., 1999
Lopez, R.; Ferreira, V.; Hernandez, P.; Cacho, J.F.,
Identification of impact odorants of young red wines made with Merlot, Cabernet Sauvignon and Grenache grape varieties: a comparative study,
J. Sci. Food Agric., 1999, 79, 11, 1461-1467, https://doi.org/10.1002/(SICI)1097-0010(199908)79:11<1461::AID-JSFA388>3.0.CO;2-K
. [all data]
Okumura, 1991
Okumura, T.,
retention indices of environmental chemicals on methyl silicone capillary column,
Journal of Environmental Chemistry (Japan), 1991, 1, 2, 333-358, https://doi.org/10.5985/jec.1.333
. [all data]
Habu, Flath, et al., 1985
Habu, T.; Flath, R.A.; Mon, T.R.; Morton, J.F.,
Volatile components of Rooibos tea (Aspalathus linearis),
J. Agric. Food Chem., 1985, 33, 2, 249-254, https://doi.org/10.1021/jf00062a024
. [all data]
Mondello, 2012
Mondello, L.,
HS-SPME-GCxGC-MS analysis of Yerba Mate (Ilex paraguariensis)
in Shimadzu GC-GC application compendium of comprehensive 2D GC, Vol. 1-5, Shimadzu Corp., 2012, 1-29. [all data]
Robinson, Adams, et al., 2012
Robinson, A.L.; Adams, D.O.; Boss, P.K.; Heymann, H.; Solomon, P.S.; Trengove, R.D.,
Influence of geographic origine on the sensory characteristics and wine composition of Vitus viniferas cv. Cabernet Sauvignon wines from Australia (Supplemental data),
Am. J. Enol. Vitic., 2012, 64, 4, 467-476, https://doi.org/10.5344/ajev.2012.12023
. [all data]
San-Juan, Petka, et al., 2010
San-Juan, F.; Petka, J.; Cacho, J.; Ferreira, V.; Escudero, A.,
Producing headspace extracts for the gas chromatography - olphactometric evaluation of wine aroma,
Food Chemistry, 2010, 123, 1, 188-195, https://doi.org/10.1016/j.foodchem.2010.03.129
. [all data]
Zhao, Li, et al., 2008
Zhao, Y.; Li, J.; Xu, Y.; Duan, H.; Fan, W.; Zhao, G.,
EXtraction, preparation and identification of volatile compounds in Changyu XO brandy,
Chinese J. Chromatogr., 2008, 26, 2, 212-222, https://doi.org/10.1016/S1872-2059(08)60014-0
. [all data]
Iraqi, Vermeulen, et al., 2005
Iraqi, R.; Vermeulen, C.; Benzekri, A.; Bouseta, A.; Collin, S.,
Screening for key odorants in Moroccan green olives by gas chromatography-olfactometry/aroma extract dilution analysis,
J. Agric. Food Chem., 2005, 53, 4, 1179-1184, https://doi.org/10.1021/jf040349w
. [all data]
Pino, Marbot, et al., 2005
Pino, J.A.; Marbot, R.; Rosado, A.; Vázquez, C.,
Volatile constituents of Malay rose apple [Syzygium malaccense (L.) Merr. Perry],
Flavour Fragr. J., 2005, 20, 98-100. [all data]
Escudero, Gogorza, et al., 2004
Escudero, A.; Gogorza, B.; Melús, M.A.; Ortín, N.; Cacho, J.; Ferreira, V.,
Characterization of the aroma of a wine from Maccabeo. Key role played by compounds with low odor activity values,
J. Agric. Food Chem., 2004, 52, 11, 3516-3524, https://doi.org/10.1021/jf035341l
. [all data]
Begnaud, Pérès, et al., 2003
Begnaud, F.; Pérès, C.; Berdagué, J.-L.,
Characterization of volatile effluents of livestock buildings by solid-phase microextraction,
Int. J. Environ. Anal. Chem., 2003, 83, 10, 837-849, https://doi.org/10.1080/03067310310001603349
. [all data]
Martí, Mestres, et al., 2003
Martí, M.P.; Mestres, M.; Sala, C.; Busto, O.; Guasch, J.,
Solid-phase microextraction and gas chromatography olfactometry analysis of successively diluted samples. A new approach of the aroma extract dilution analysis applied to the characterization of wine aroma,
J. Agric. Food Chem., 2003, 51, 27, 7861-7865, https://doi.org/10.1021/jf0345604
. [all data]
Ferreira, Ortín, et al., 2002
Ferreira, V.; Ortín, N.; Escudero, A.; López, R.; Cacho, J.,
Chemical characterization of the aroma of grenache Rosé wines: aroma extract dilution analysis, quantitative determination, and sensory reconstitution studies,
J. Agric. Food Chem., 2002, 50, 14, 4048-4054, https://doi.org/10.1021/jf0115645
. [all data]
Aznar, López, et al., 2001
Aznar, M.; López, R.; Cacho, J.F.; Ferreira, V.,
Identification and quantification of impact odorants of aged red wines from Rioja. GC-olfactometry, quantitative GC-MS, and odor evaluation of HPLC fractions,
J. Agric. Food Chem., 2001, 49, 6, 2924-2929, https://doi.org/10.1021/jf001372u
. [all data]
Ferreira, Aznar, et al., 2001
Ferreira, V.; Aznar, M.; López, R.; Cacho, J.,
Quantitative gas chromatography-olfactometry carried out at different dilutions of an extract. Differences in the odor profiles of four high-quality spanish aged red wines,
J. Agric. Food Chem., 2001, 49, 10, 4818-4824, https://doi.org/10.1021/jf010283u
. [all data]
Licker, Acree, et al., 1998
Licker, J.L.; Acree, T.E.; Henick-Kling, T.,
What is Brett (Brettanomyces) flavor?,
Am. Chem. Soc. Symp. Ser., 1998, 714, 96-115. [all data]
Peterson, 1992
Peterson, K.L.,
Counter-Propagation Neural Networks in the Modeling and Prediction of Kovats Indices for Substituted Phenols,
Anal. Chem., 1992, 64, 4, 379-386, https://doi.org/10.1021/ac00028a011
. [all data]
Waggott and Davies, 1984
Waggott, A.; Davies, I.W.,
Identification of organic pollutants using linear temperature programmed retention indices (LTPRIs) - Part II, 1984, retrieved from http://dwi.defra.gov.uk/research/completed-research/reports/dwi0383.pdf. [all data]
Wanakhachornkrai and Lertsiri, 9999
Wanakhachornkrai, P.; Lertsiri, S.,
Comparison of determination method for volatile compounds in Thai soy sauce,
Analytical, Nutritional and Clinical Methods, 9999, 1-11. [all data]
Moon and Shibamoto, 2010
Moon, J.-K.; Shibamoto, T.,
Formation of volatile chemicals from thermal degradation of less volatile cofee components: quinic acid, caffeic acid, and chlorogenic acid,
J. Agric. Food Chem., 2010, 58, 9, 5465-5470, https://doi.org/10.1021/jf1005148
. [all data]
Zhao, Xu, et al., 2009
Zhao, Y.; Xu, Y.; Li, J.; Fan, W.; Jiang, W.,
Profile of volatile compounds in 11 brandies by headspace solid-phase microextraction followed by gas chromatography-mass spectrometry,
J. Food. Sci., 2009, 74, 2, c90-c99, https://doi.org/10.1111/j.1750-3841.2008.01029.x
. [all data]
Caldeira, de Sousa, et al., 2008
Caldeira, I.; de Sousa, R.B.; Balchior, A.P.; Climaco, M.C.,
A sensory and chemical approach to the aroma of wooden aged Lourinha wine brandy,
Ciencia Tec. Vitiv., 2008, 23, 2, 97-110. [all data]
Vichi, Romero, et al., 2008
Vichi, S.; Romero, A.; Tous, J.; Tamames, E.L.; Buxaderas, S.,
Determination of volatile phenols in virgin olive oil and their sensory significatnce,
J. Chromatoghr. A., 2008, 1211, 1-2, 1-7, https://doi.org/10.1016/j.chroma.2008.09.067
. [all data]
Fan and Qian, 2006, 2
Fan, W.; Qian, M.C.,
Characterization of Aroma Compounds of Chinese Wuliangye and Jiannanchun Liquors by Aroma Extract Dilution Analysis,
J. Agric. Food Chem., 2006, 54, 7, 2695-2704, https://doi.org/10.1021/jf052635t
. [all data]
Perestrelo, Fernandes, et al., 2006
Perestrelo, R.; Fernandes, A.; Albuquerque, F.F.; Marques, J.C.; Camara, J.S.,
Analytical characterization of the aroma of Tinta Negra Mole red wine: Identification of the main odorants compounds,
Anal. Chim. Acta., 2006, 563, 1-2, 154-164, https://doi.org/10.1016/j.aca.2005.10.023
. [all data]
Fan and Qian, 2005
Fan, W.; Qian, M.C.,
Headspace Solid Phase Microextraction and Gas Chromatography-Olfactometry Dilution Analysis of Young and Aged Chinese Yanghe Daqu Liquors,
J. Agric. Food Chem., 2005, 53, 20, 7931-7938, https://doi.org/10.1021/jf051011k
. [all data]
Culleré, Escudero, et al., 2004
Culleré, L.; Escudero, A.; Cacho, J.; Ferreira, V.,
Gas chromatography-olfactometry and chemical quantitative study of the aroma of six premium auality Spanish aged red wines,
J. Agric. Food Chem., 2004, 52, 6, 1653-1660, https://doi.org/10.1021/jf0350820
. [all data]
López, Ezpeleta, et al., 2004
López, R.; Ezpeleta, E.; Sánchez, I.; Cacho, J.; Ferreira, V.,
Analysis of the aroma intensities of volatile compounds released from mild acid hydrolysates of odourless precursors extracted from Tempranillo and Grenache grapes using gas chromatography-olfactometry,
Food Chem., 2004, 88, 1, 95-103, https://doi.org/10.1016/j.foodchem.2004.01.025
. [all data]
Lee and Noble, 2003
Lee, S.-J.; Noble, A.C.,
Characterization of odor-active compounds in Californian Chardonnay wines using GC-olfactometry and GC-mass spectrometry,
J. Agric. Food Chem., 2003, 51, 27, 8036-8044, https://doi.org/10.1021/jf034747v
. [all data]
López, Ortín, et al., 2003
López, R.; Ortín, N.; Pérez-Trujillo, J.P.; Cacho, J.; Ferreira, V.,
Impact odorants of different young white wines from the Canary islands,
J. Agric. Food Chem., 2003, 51, 11, 3419-3425, https://doi.org/10.1021/jf026045w
. [all data]
Wanakhachornkrai and Lertsiri, 2003
Wanakhachornkrai, P.; Lertsiri, S.,
Analytical, nutritional, and clinical methods. Comparison of determination method for volatile compounds in Thai soy sauce,
Food Chem., 2003, 83, 4, 619-629, https://doi.org/10.1016/S0308-8146(03)00256-5
. [all data]
Bendall, 2001
Bendall, J.G.,
Aroma compounds of fresh milk from New Zealand cows fed different diets,
J. Agric. Food Chem., 2001, 49, 10, 4825-4832, https://doi.org/10.1021/jf010334n
. [all data]
Shuichi, Masazumi, et al., 1996
Shuichi, H.; Masazumi, N.; Hiromu, K.; Kiyoshi, F.,
Comparison of volatile compounds berween the crude drugs, Onji-tsutsu and Onji-niki,
Nippon nogei kagaku kaishi, 1996, 70, 2, 151-160. [all data]
Andersen J.F., Mikolajczak K.L., et al., 1987
Andersen J.F.; Mikolajczak K.L.; Reed D.K.,
Analysis of peach bark volatiles and their electroantennogram activity with lesser pechtree borer, Synanthedon pictipes (Grote and Robinson),
J. Chem. Ecol., 1987, 13, 11, 2103-2114, https://doi.org/10.1007/BF01012874
. [all data]
Seifert and King, 1982
Seifert, R.M.; King, A.D., Jr.,
Identification of some volatile constituents of Aspergillus clavatus,
J. Agric. Food Chem., 1982, 30, 4, 786-790, https://doi.org/10.1021/jf00112a044
. [all data]
Welke, Manfroi, et al., 2012
Welke, J.E.; Manfroi, V.; Zanus, M.; Lazarotto, M.; Zini, C.A.,
Characterization of the volatile profile of Brazilian merlot wines through comprehensive two dimensional gas chromatography time-of-flight mass spectrometric detection,
J. Chromatogr. A, 2012, 1226, 124-139, https://doi.org/10.1016/j.chroma.2012.01.002
. [all data]
Chinnici, Guerrero, et al., 2009
Chinnici, F.; Guerrero, E.D.; Sonni, F.; Natali, N.; Marin, R.N.; Riponi, C.,
Gas chromatography - mass spectrometry (GC-MS) characterization of volatile compounds in quality vinegars with protected Europian geographical indication,
J. Agric. Food Chem., 2009, 57, 11, 4784-4792, https://doi.org/10.1021/jf804005w
. [all data]
Shu and Shen, 2008
Shu, N.; Shen, H.,
Aroma-impact compounds in Lysimachia foenum-graecum extracts,
Flavour Fragr. J., 2008, 24, 1, 1-6, https://doi.org/10.1002/ffj.1908
. [all data]
Tao, Wenlai, et al., 2008
Tao, L.; Wenlai, F.; Yan, X.,
Characterization of volatile and semi-volatile compounds in Chinese rica wines by headspace solid phase microextraction followed by gas chromatography - mass spectrometry,
J. Inst. Brew., 2008, 114, 2, 172-179, https://doi.org/10.1002/j.2050-0416.2008.tb00323.x
. [all data]
Tian, Zhang, et al., 2007
Tian, Y.; Zhang, X.; Huang, T.; Zou, K.; Zhou, J.,
Research advances on the essential oils from leaves of Eucalyptus,
Food Fermentation Ind. (Chinese), 2007, 33, 10, 143-147. [all data]
Vinogradov, 2004
Vinogradov, B.A.,
Production, composition, properties and application of essential oils, 2004, retrieved from http://viness.narod.ru. [all data]
Erdemoglu, Sener, et al., 2003
Erdemoglu, N.; Sener, B.; Demirci, B.; Baser, K.H.C.,
The glycosidically bound volatile compounds of Taxus baccata,
Chem. Nat. Compd. (Engl. Transl.), 2003, 39, 2, 195-198, https://doi.org/10.1023/A:1024870031960
. [all data]
Torrens, 2002
Torrens, J.,
El análisis del aroma aplicado al control de calidad del cava [CS2002 Análisis sensorial (vino)], 2002, retrieved from http://www.percepnet.com/documenta/CS0203.pdf. [all data]
López and Dufour, 2001
López, M.G.; Dufour, J.P.,
Chapter 6. Tequilas: charm analysis of Blanco, Teposado, and Anejo tequilas,
Am. Chem. Soc. Symp. Ser., 2001, 782, 62-72. [all data]
Zimmermann, Lauterbach, et al., 1985
Zimmermann, V.; Lauterbach, M.; Jaeger, G.,
Analytical characterization phenolic compounds obtained from phenosolvan-extracts by use of gas-chromatography with capillary columns,
Chem. Tech. (Leipzig), 1985, 37, 11, 476-478. [all data]
Shao, Wang, et al., 2006
Shao, X.; Wang, G.; Sun, Y.; Zhang, R.; Xie, K.; Liu, H.,
Determination and Characterization of the Pyrolysis Products of Isoprocarb by GC-MS,
J. Chromatogr. Sci., 2006, 44, 3, 141-147, https://doi.org/10.1093/chromsci/44.3.141
. [all data]
Williams and Horne, 1995
Williams, P.T.; Horne, P.A.,
Analysis of aromatic hydrocarbons in pyrolytic oil derived from biomass,
J. Anal. Appl. Pyrolysis, 1995, 31, 15-37, https://doi.org/10.1016/0165-2370(94)00814-H
. [all data]
Donnelly, Abdel-Hamid, et al., 1993
Donnelly, J.R.; Abdel-Hamid, M.S.; Jeter, J.L.; Gurka, D.F.,
Application of gas chromatographic retention properties to the identification of environmental contaminants,
J. Chromatogr., 1993, 642, 1-2, 409-415, https://doi.org/10.1016/0021-9673(93)80106-I
. [all data]