Argon, compound with neon (1:1)
- Formula: ArNe
- Molecular weight: 60.128
- IUPAC Standard InChIKey: JXBFBSYDINUVRE-UHFFFAOYSA-N
- CAS Registry Number: 12301-65-4
- Chemical structure:
View 3d structure (requires JavaScript / HTML 5) - Permanent link for this species. Use this link for bookmarking this species for future reference.

Gas phase ion energetics data

Data compiled as indicated in comments:
LBLHLM - Sharon G. Lias, John E. Bartmess, Joel F. Liebman, John L. Holmes, Rhoda D. Levin, and W. Gary Mallard
Ionization energy determinations
IE (eV) | Method | Reference | Comment |
---|---|---|---|
15.685 ± 0.004 | PI | Pratt and Dehmer, 1982 | T = 0K; LBLHLM |

Constants of diatomic molecules

Data compiled by: Klaus P. Huber and Gerhard H. Herzberg
Data collected through March, 1977
Symbol | Meaning |
---|---|
State | electronic state and / or symmetry symbol |
Te | minimum electronic energy (cm-1) |
ωe | vibrational constant – first term (cm-1) |
ωexe | vibrational constant – second term (cm-1) |
ωeye | vibrational constant – third term (cm-1) |
Be | rotational constant in equilibrium position (cm-1) |
αe | rotational constant – first term (cm-1) |
γe | rotation-vibration interaction constant (cm-1) |
De | centrifugal distortion constant (cm-1) |
βe | rotational constant – first term, centrifugal force (cm-1) |
re | internuclear distance (Å) |
Trans. | observed transition(s) corresponding to electronic state |
ν00 | position of 0-0 band (units noted in table) |
State | Te | ωe | ωexe | ωeye | Be | αe | γe | De | βe | re | Trans. | ν00 |
---|---|---|---|---|---|---|---|---|---|---|---|---|
X 1Σ+ | 0 | [(20.9)] 1 | 3.43 2 3 | |||||||||
↳Bosomworth and Gush, 1965 |

References

Pratt and Dehmer, 1982
Pratt, S.T.; Dehmer, P.M.,
Photoionization of the neon-rare gas dimers NeAr, NeKr, and NeXe,
J. Chem. Phys., 1982, 76, 3433. [all data]
Bosomworth and Gush, 1965
Bosomworth, D.R.; Gush, H.P.,
Collision-induced absorption of compressed gases in the far infrared, Part II,
Can. J. Phys., 1965, 43, 751. [all data]
Bobetic and Barker, 1976
Bobetic, M.V.; Barker, J.A.,
Vibrational levels of heteronuclear rare gas van der Waals molecules,
J. Chem. Phys., 1976, 64, 2367-2369. [all data]
Ng, Lee, et al., 1974
Ng, C.Y.; Lee, Y.T.; Barker, J.A.,
Improved potentials for Ne + Ar, Ne + Kr, and Ne + Xe,
J. Chem. Phys., 1974, 61, 1996. [all data]
Matcha and Nesbet, 1967
Matcha, R.L.; Nesbet, R.K.,
Electric dipole moments of rare-gas diatomic molecules,
Phys. Rev., 1967, 160, 1, 72-75. [all data]
Bar-Ziv and Weiss, 1973
Bar-Ziv, E.; Weiss, S.,
Dipole moment of interacting rare-gas atoms,
Chem. Phys. Lett., 1973, 19, 1, 148-151. [all data]