Cerium, compound with palladium(1:1)

Gas phase ion energetics data

Data compiled by: Sharon G. Lias, Rhoda D. Levin, and Sherif A. Kafafi

Ionization energy determinations

IE (eV) Method Reference
6.2 ± 0.5EICocke and Gingerich, 1972

References

Cocke and Gingerich, 1972
Cocke, D.L.; Gingerich, K.A., Mass spectrometric determination of the bond dissociation energies of the molecules CePd and CeC2, J. Phys. Chem., 1972, 76, 2332. [all data]