Potassium, compound with sodium(1:2)

Gas phase ion energetics data

Data compiled as indicated in comments:
LLK - Sharon G. Lias, Rhoda D. Levin, and Sherif A. Kafafi
RDSH - Henry M. Rosenstock, Keith Draxl, Bruce W. Steiner, and John T. Herron
B - John E. Bartmess

Electron affinity determinations

EA (eV) Method Reference Comment
1.167 ± 0.050LPESEaton, Sarkas, et al., 1992Vertical Detachment Energy: 1.264±0.015 eV.; B

Ionization energy determinations

IE (eV) Method Reference Comment
3.7 ± 0.1PIHerrmann, Leutwyler, et al., 1978LLK
3.6 ± 0.1PIFoster, Leckenby, et al., 1969RDSH

References

Eaton, Sarkas, et al., 1992
Eaton, J.G.; Sarkas, H.W.; Arnold, S.T.; Mchugh, K.M.; Bowen, K.H., Negative Ion Photoelectron Spectroscopy of the Heteronuclear Alkali-Metal Dimer and Trimer Anions - NaK-, KRb-, RbCS-, KCs-, Na2K-, and K2Cs, Chem. Phys. Lett., 1992, 193, 1-3, 141, https://doi.org/10.1016/0009-2614(92)85697-9 . [all data]

Herrmann, Leutwyler, et al., 1978
Herrmann, A.; Leutwyler, S.; Schumacher, E.; Woste, L., 38. On metal-atom clusters IV. Photoionization thresholds and multiphoton ionization spectra of alkali-metal molecules, Helv. Chim. Acta, 1978, 61, 453. [all data]

Foster, Leckenby, et al., 1969
Foster, P.J.; Leckenby, R.E.; Robbins, E.J., The ionization potentials of clustered alkali metal atoms, J. Phys. B:, 1969, 2, 478. [all data]