Dipotassium diiodide
- Formula: I2K2
- Molecular weight: 332.0055
- IUPAC Standard InChIKey: HIEFXWXCLCHBPG-UHFFFAOYSA-L
- CAS Registry Number: 12285-99-3
- Chemical structure:

Gas phase thermochemistry data

Quantity | Value | Units | Method | Reference | Comment |
---|---|---|---|---|---|
ΔfH°gas | -422.17 | kJ/mol | Review | Chase, 1998 | Data last reviewed in June, 1967 |
Quantity | Value | Units | Method | Reference | Comment |
S°gas,1 bar | 395.77 | J/mol*K | Review | Chase, 1998 | Data last reviewed in June, 1967 |
Gas Phase Heat Capacity (Shomate Equation)
Cp° = A + B*t + C*t2 + D*t3 +
E/t2
H° − H°298.15= A*t + B*t2/2 +
C*t3/3 + D*t4/4 − E/t + F − H
S° = A*ln(t) + B*t + C*t2/2 + D*t3/3 −
E/(2*t2) + G
Cp = heat capacity (J/mol*K)
H° = standard enthalpy (kJ/mol)
S° = standard entropy (J/mol*K)
t = temperature (K) / 1000.
View plot Requires a JavaScript / HTML 5 canvas capable browser.
Temperature (K) | 298. to 6000. |
---|---|
A | 83.13985 |
B | 0.003864 |
C | -0.001055 |
D | 0.000091 |
E | -0.078562 |
F | -447.2194 |
G | 495.9421 |
H | -422.1656 |
Reference | Chase, 1998 |
Comment | Data last reviewed in June, 1967 |

Gas phase ion energetics data

Data compiled by: Henry M. Rosenstock, Keith Draxl, Bruce W. Steiner, and John T. Herron
Appearance energy determinations
Ion | AE (eV) | Other Products | Method | Reference | Comment |
---|---|---|---|---|---|
K2I+ | 8.2 ± 0.3 | I | EI | Platel, 1965 |

References

Chase, 1998
Chase, M.W., Jr.,
NIST-JANAF Themochemical Tables, Fourth Edition,
J. Phys. Chem. Ref. Data, Monograph 9, 1998, 1-1951. [all data]
Platel, 1965
Platel, G.,
Mesures des potentials d'apparition des ions obtenus par impact electronique dans la phase vapeur des iodures alcalins et des melanges LiI-MI,
J. Chim. Phys., 1965, 62, 1176. [all data]