Acetamide, N-(4-aminophenyl)-
- Formula: C8H10N2O
- Molecular weight: 150.1778
- IUPAC Standard InChIKey: CHMBIJAOCISYEW-UHFFFAOYSA-N
- CAS Registry Number: 122-80-5
- Chemical structure:
View 3d structure (requires JavaScript / HTML 5) - Other names: Acetanilide, 4'-amino-; p-(Acetylamino)aniline; p-Acetamidoaniline; p-Acetoaminoaniline; p-Aminoacetanilide; Acetparamin; Acetyl-p-phenylenediamine; C.I. Oxidation Base 19; C.I. 76005; Fourrine A; Fourrine 88; N-(p-Aminophenyl)acetamide; N-Acetyl-p-phenylenediamine; 1-Amino-4-(acetylamino)benzene; 4-(Acetylamino)aniline; 4-Acetamidoaniline; 4-Aminoacetanilide; 4'-Aminoacetanilide; p-Acetaminoaniline; N-Acetyl-p-fenylendiamin; 4'-Aminoacetanilid; N-(4-Aminophenyl)acetamide; 4-Acetoamidoaniline; N-Acetyl-1,4-benzenediamine; Paracetamin; NSC 2135

Gas phase ion energetics data

Data compiled by: Sharon G. Lias, Rhoda D. Levin, and Sherif A. Kafafi
Ionization energy determinations
IE (eV) | Method | Reference |
---|---|---|
7.12 ± 0.02 | EI | Benezra and Bursey, 1972 |
Appearance energy determinations
Ion | AE (eV) | Other Products | Method | Reference | Comment |
---|---|---|---|---|---|
C6H7N2+ | 13.72 ± 0.02 | CH3CO | EI | Benezra and Bursey, 1972 | |
C6H8N2+ | 10.06 ± 0.02 | CH2=C=O | EI | Benezra and Bursey, 1972 |

References

Benezra and Bursey, 1972
Benezra, S.A.; Bursey, M.M.,
Hydrogen bonding in mass spectral activated complexes. A correction,
J. Chem. Soc. Perkin Trans. 2, 1972, 11, 1537. [all data]