Iron, tetracarbonyl(2,4-dimethyl-2,3-pentadiene)-

Gas phase ion energetics data

Data compiled by: Sharon G. Lias, Rhoda D. Levin, and Sherif A. Kafafi

Ionization energy determinations

IE (eV) Method Reference Comment
7.84PEHill, Ward, et al., 1979Vertical value

References

Hill, Ward, et al., 1979
Hill, W.E.; Ward, C.H.; Webb, T.R.; Worley, S.D., Electronic structures of (alkene)iron tetracarbonyl compounds, Inorg. Chem., 1979, 18, 2029. [all data]