Nickel,bis(1,2,3-η)-2-methyl-2-propenyl-)-
- Formula: C8H14Ni
- Molecular weight: 168.8902
- IUPAC Standard InChIKey: ISFNOEIPZOFMQG-UHFFFAOYSA-N
- CAS Registry Number: 12261-14-2
- Chemical structure:
View 3d structure (requires JavaScript / HTML 5) - Other names: Nickel,bis(1,2,3-η3)-2-methyl-2-propenyl-)-

Gas phase ion energetics data

Data compiled by: Sharon G. Lias, Rhoda D. Levin, and Sherif A. Kafafi
Ionization energy determinations
IE (eV) | Method | Reference | Comment |
---|---|---|---|
7.53 | PE | Bohm, Gleiter, et al., 1980 | Vertical value |
7.53 | PE | Batich, 1976 | Vertical value |

References

Bohm, Gleiter, et al., 1980
Bohm, M.C.; Gleiter, R.; Batich, C.D.,
106. The photoelectron spectra of (Ni, Pd, Pt-Diallyl),
Helv. Chim. Acta, 1980, 63, 990. [all data]
Batich, 1976
Batich, C.,
Photoelectron spectroscopy of bis(π-allyl) nickel and its methyl substituted derivatives: support for the near validity of Koopmans' Theorem,
J. Am. Chem. Soc., 1976, 98, 7585. [all data]